2026年FPGA校招,面试官让我手撕Verilog实现AXI4-Stream实时视频拼接,多路摄像头输入帧对齐怎么设计?我想到用FIFO缓冲,但多路帧率不一致时容易丢帧。求具体的设计方案,比如行同步信号对齐、帧计数器同步、以及资源优化技巧。谢谢!
2026年FPGA校招,手撕Verilog实现AXI4-Stream实时视频拼接,多路输入帧对齐怎么设计才能不漏帧?
10 个回答

面试官让你手撕 AXI4-Stream 实时视频拼接,核心其实是在考察你对「帧对齐」和「数据流控制」的理解深度,而不是背一个固定模板。多路帧率不一致丢帧,常见误区是只盯着帧同步信号(VSYNC)去对齐,忽略了行级别的缓冲和流水线延迟。我建议你从「两级缓存+帧起始对齐」的思路去准备:每路输入先用一个异步FIFO缓存一整行数据,深度按最大行像素数加余量算,比如 1920 像素的 1080p 视频,FIFO 深度至少 2048,位宽匹配 AXI4-Stream 的 tdata 宽度(通常是 8/10/16 位)。然后,不直接用 VSYNC 去触发拼接,而是用一个全局帧计数器,在检测到任意一路 VSYNC 有效时,将计数器的值锁存到该路的帧起始寄存器里。拼接逻辑只在所有路的帧起始寄存器计数差在某个阈值内(比如 1 行时间)时,才启动当前帧的拼接。这样即使帧率差一点,也能容忍几个行周期的抖动,不会丢帧。关键取舍在于:FIFO 深度不能只按帧率差算,要按最大帧周期差加上行缓存需求来定——比如一路 30fps 另一路 60fps,你需要缓冲至少半帧的数据才能保证慢速路不饿死。资源优化上,注意 AXI4-Stream 的 tready/tvalid 握手信号要双向处理,拼接输出侧如果下游反压,要把每路 FIFO 的写使能暂时冻结,否则溢出丢帧。面试官如果追问时序收敛,你就说把 FIFO 读写时钟域分开,用格雷码同步空满信号,这是标准做法。另外,手撕代码时别一上来就写状态机,先画出数据流图,标清楚每个 AXI-Stream 通道的 tuser(帧起始)和 tlast(行尾)信号怎么在拼接模块内部重新生成。如果面试官让你现场写代码,可以试试用参数化的模块,把输入路数 N 和行缓存深度做成 parameter,这样显得你有工程复用的意识。你目前有实际跑过仿真或者上板测试过这种拼接逻辑吗?还是只停留在理论推导阶段?

多路帧对齐丢帧,其实不用想得太复杂。面试官主要看你会不会用 FIFO 做行缓冲,以及怎么处理帧起始信号不同步。你直接说:每路视频进一个独立异步 FIFO,深度至少为一行像素数加 2 个字的余量,防止行尾溢出。帧对齐靠检测所有路的 TUSER(帧起始)信号,当检测到所有路都在一个行时间内有帧起始时,用计数器锁存同步点,之后按行号顺序读出拼接。丢帧的根本原因是 FIFO 读使能没配合好,你只要保证在拼接输出侧有空闲时,才从 FIFO 里取数据,配合 tready/tvalid 握手机制就行。面试官大概率不会让你写完整代码,重点是讲清楚握手和 FIFO 深度选择的依据。你最近有拿 Vivado 或 Quartus 试过这种设计吗?

面试官让你手撕多路视频拼接,其实不算刁难,因为工程里这种场景很常见。我直接说核心:丢帧的根因不是FIFO缓冲不够,而是你让拼接逻辑被动接收数据,没有主动反压。AXI4-Stream的tready/tvalid握手是白送的资源,一定要用上。具体设计时,每路输入后面挂一个异步FIFO,深度按最大行像素数加两行余量来算——比如1920宽的1080p,深度选2048或4096,位宽对齐tdata。然后别用VSYNC直接触发拼接,因为多路帧起始时间可能差好几行。正确做法是:每路FIFO的写侧只管缓存整行数据,读侧由一个全局状态机控制,它先检测所有路的帧起始标志(比如TUSER信号),等到所有路都在一个行时间窗口内出现了帧起始,就锁存一个同步行号。之后读操作按行号递增发起,每读一行前检查对应FIFO的almost_empty是否拉高,如果拉高就暂停读使能,保持tready为低,让上游反压。这样即使某路帧率慢一拍,也只是等它填满一行再读,不会丢数据。资源优化上,别用Block RAM给每路单独做大FIFO,改用Distributed RAM做小行缓冲,配合外部DDR存多帧历史,面试官更看重你懂资源权衡。你目前是用Vivado还是Quartus做仿真?不同工具对异步FIFO的IP配置差异挺大的。

你纠结帧对齐丢帧,其实换个角度想就简单了:把问题拆成两步,先同步帧起始,再逐行拼接。帧起始同步用计数器,检测到某路VSYNC就锁存当前计数值,当所有路计数值相差不超过一行时间时,认为对齐。行拼接时,每路用一个深度为行像素数加16的异步FIFO,读使能统一由行计数器控制,读之前检查FIFO是否有数据,没有就等一拍。这样即使帧率波动,也只是等数据到位,不会漏帧。面试官主要想看你对握手协议的理解够不够扎实。

面试官让你手撕多路视频拼接,核心不是考你背FIFO深度公式,而是看你在资源受限时怎么权衡。我建议你别一上来就想着用全局帧计数器同步所有路,因为实际工程中各路VSYNC可能差几个行周期,硬等对齐反而让后端FIFO溢出丢帧。更稳妥的做法是:每路单独用一个异步FIFO缓存整行数据,深度按最大行像素数的1.5倍取2的幂,比如1080p用2048深度。然后拼接逻辑只在每路FIFO的写指针越过某个水位线(比如半满)时才启动读操作,用行计数器统一控制读使能,这样即使某路帧起始晚来几行,只要FIFO没空,读侧就能连续输出,不会丢帧。资源优化方面,可以把多路FIFO的读时钟域合并到一个写时钟域,减少跨时钟域处理开销。你最近有考虑用Xilinx的FIFO Generator IP核做验证吗?那个自带almost_empty信号,能省不少握手逻辑。

很多人纠结帧对齐丢帧,其实换个角度想:丢帧的根因不是FIFO深度不够,而是你让拼接逻辑被动接收数据,没有主动反压。面试官真正想听的是你对AXI4-Stream握手机制的理解。具体设计时,每路输入后面挂一个异步FIFO,深度按最大行像素数加两行余量算——比如1920宽的1080p,深度选4096,位宽对齐tdata。然后别用VSYNC直接触发拼接,因为多路帧起始时间可能差好几行。正确做法是:每路FIFO的写侧只管缓存整行数据,读侧由一个全局状态机控制,它先检测所有路的帧起始标志(比如TUSER信号),等到所有路都在一个行时间窗口内出现了帧起始,就锁存一个同步行号。之后读操作按行号递增发起,每读一行前检查对应FIFO的almost_empty,如果空就等一拍,同时把输出侧的tready拉低反压回去。这样即使帧率波动,也只是等数据到位,不会丢帧。面试官大概率会让你画握手时序图,你最好提前把tvalid/tready的联动关系理清楚。另外资源优化上,可以用Block RAM实现FIFO,比分布式RAM省LUT,但要注意BRAM的读写延迟。你平时用Vivado仿真时,有试过用AXI VIP来模拟多路输入吗?那样能更早暴露对齐问题。

帧对齐丢帧,其实不用想得太复杂。面试官主要看你会不会用FIFO做行缓冲,以及怎么处理帧起始信号不同步。你直接说:每路视频进一个独立异步FIFO,深度至少为一行像素数加2个字的余量,防止行尾溢出。帧对齐靠检测所有路的TUSER(帧起始)信号,当检测到所有路都在一个行时间内有帧起始时,用计数器锁存同步点,之后按行号顺序读出拼接。丢帧的根本原因是FIFO读使能没配合好,你只要保证在拼接输出侧有空闲时,才从FIFO里取数据,配合tready/tvalid握手机制就行。面试官大概率不会让你写完整代码,重点是讲清楚握手和FIFO深度选择的依据。你最近有拿Vivado或Quartus试过这种设计吗?

面试官问帧对齐丢帧,其实是想看你有没有意识到:VSYNC只是参考,不能靠它硬等。我一般每路先挂一个深度2048的异步FIFO,写侧只管收数据,读侧用一个全局行计数器控制。帧起始检测用TUSER信号,检测到就锁存当前行号,等所有路行号差不超过1行时,统一开始读。这样帧率差一两行不会丢帧,因为FIFO里已经缓存了行数据。你手撕时重点把tready/tvalid反压写清楚,面试官就不会揪着丢帧细节不放。

说个你可能没太在意的点:丢帧很多时候不是FIFO深度不够,而是你让拼接逻辑被动接收,没有主动反压。AXI4-Stream的tready就是给你干这个的。具体做法:每路输入后放一个异步FIFO,深度按最大行像素数加两行余量算,比如1080p用4096深度。别用VSYNC直接触发拼接,因为多路帧起始可能差好几行。正确做法是,每路FIFO写侧只管缓存整行,读侧由一个状态机控制,它先检测所有路的帧起始标志(TUSER),等所有路都在一个行时间窗口内出现了帧起始,就锁存一个同步行号。然后读操作按行号递增发起,每读一行前检查对应FIFO的almost_empty,如果空就等一拍,同时把输出侧的tready拉低反压回去。这样即使帧率波动,也只是等数据到位,不会漏帧。面试官如果追问资源优化,你可以说把多路FIFO的读时钟域合并到一个写时钟域,减少跨时钟域处理开销。

校招面试手撕这个,我建议你别只盯着对齐逻辑,因为面试官更想看你面对「资源不够用」时的取舍思路。多路帧率不一致丢帧,常规解法是每路一个异步FIFO加帧计数器同步,但实际工程里有个坑:帧同步信号(VSYNC)宽度和相位可能不同,简单锁存计数器会导致误对齐。我见过有人用双寄存器打拍加边沿检测,结果因为跨时钟域没处理好,采到毛刺就乱套了。正确做法是,先把VSYNC用两级寄存器同步到读时钟域,再用边沿检测生成一个单周期脉冲,触发帧计数器锁存。锁存值不直接用于拼接,而是作为一个参考点,等所有路的锁存值相差在某个阈值内(比如半行时间),才生成一个全局同步帧起始信号。这样即使某路帧来晚了半个行周期,也不会丢帧。另外,FIFO深度计算别死套公式。你要根据最大帧率差和行缓存需求来算:假设两路帧率差5%,一路1080p@60Hz,另一路@57Hz,那么每秒差3帧,每帧约16.7ms,一行时间约15.4us(1920像素@150MHz),那么最坏情况下一路比另一路多积累了约1083行数据。但FIFO深度不需要覆盖这么多,因为拼接逻辑会逐行消费,实际只需要缓冲一至两行数据,配合反压就能平滑帧率波动。深度选2048或4096足够。面试时你把这个计算过程讲清楚,比背答案更能加分。手撕代码时,我建议你只写核心的状态机:IDLE、WAIT_ALIGN、READ_ROW、OUTPUT,每个状态里说清楚tvalid和tready的赋值逻辑就行。面试官一般不会让你写完所有FIFO例化,重点是握手机制。你最近有在FPGA开发板上调过AXI4-Stream的仿真吗?如果只是看波形,可以试试用Vivado的AXI Verification IP搭个简单testbench,跑一下行级反压场景,比纯理论理解快很多。
发表回答
登录后可在本页底部提交回答