2026年FPGA校招,面试官问Verilog实现AXI4-Stream实时视频拼接,多路输入帧对齐怎么设计才能不漏帧?

开放10 回答 98 浏览

2026年FPGA校招,面试官让我手撕Verilog实现AXI4-Stream实时视频拼接,多路输入帧对齐怎么设计才能不漏帧?比如4路1080p输入,帧率不同步,怎么用FIFO和同步信号对齐?求具体代码框架和时序约束,最好有仿真波形。

分享:

10 个回答

  • Data新手

    面试官其实就想看你对跨时钟域和帧起始标记的理解。4路1080p帧率不同步,核心就是用异步FIFO做缓冲,每路单独写,然后用最早到达的VSYNC作为全局读使能信号,统一把FIFO里的数据按行同步时序拉出来。漏帧通常发生在读指针追写指针的时候,只要FIFO深度够覆盖最大帧率差,再加个空满标志的防误判逻辑就行。你校招现场写个双口RAM加握手状态机就能过。

  • 逻辑设计新手

    个人感觉校招手撕这个题,关键不是代码多完整,而是你有没有意识到帧对齐的脆弱性。面试官可能先让你画框图:每路AXI4-Stream进来先解析出VSYNC和HSYNC,每路都挂一个异步FIFO,写时钟用输入端的,读时钟用输出端的统一像素时钟。对齐逻辑一般选第一路VSYNC作为全局复位/启动信号,其他路检测到自己的VSYNC后,用输出时钟域的计数器去匹配第一路的行号,如果发现某一路的行号落后或者超前,就通过丢弃或重复行来同步。你写代码时记得把FIFO的prog_full和prog_empty用上,不然在跨时钟域下容易丢帧。仿真波形里重点展示两路VSYNC时间差很大时,输出端仍然能保持完整帧。

  • 码电路的小李

    这个题我去年帮学弟模拟过,面试官其实分了三个层次在考察你。第一层:知不知道用FIFO做速率匹配——最基础,大部分人能答出来。第二层:帧对齐的具体做法是等所有路的VSYNC都到达后再统一开始读,还是用某个主路同步从路?常见误区是用一个全局VSYNC直接复位所有FIFO的读使能,这样如果某路晚到了一帧,你会把那帧的前半截丢掉。正确做法是每路FIFO都缓存一完整帧,输出端用最早到达那路的VSYNC触发一个帧起始计数器,其他路在输出端用行号匹配的方式插入等待或跳行,这样每路都输出完整帧,只是不同路的帧起始时间差被吸收掉了。第三层:时序约束——你需要在同步器上设false path,在FIFO的读写时钟域之间设set_clock_groups -asynchronous。仿真波形里要能看到当两路VSYNC相差200个时钟周期时,输出端两路的第一行数据分别来自不同帧号,但行号和像素位置对齐。另外提一嘴,如果面试官追问深度怎么选,你可以说按最大帧率差计算,比如输入帧率30fps和60fps,输出时钟是150MHz,1080p一帧约207万像素,深度至少设成两倍最大差,再加安全裕量。你目前是用Vivado还是Quartus?不同工具对异步FIFO的IP核配置有点细节差异,要是能说清楚工具链会加分。

  • Verilog入门者

    校招现场手撕这题,我猜面试官最想看的不是你FIFO写得有多花哨,而是你有没有意识到帧对齐的脆弱性。我的建议是画框图时先说明白:每路AXI4-Stream进来先解析VSYNC和HSYNC,各自挂一个异步FIFO,写时钟用输入端的,读时钟用输出端的统一像素时钟。对齐逻辑选最早到达那路的VSYNC作为全局读启动,其他路在输出时钟域里用行号计数器去匹配,落后就丢弃多余行,超前就重复行。FIFO深度算好,覆盖最大帧率差就行。你写代码时顺手把prog_full和prog_empty用上,跨时钟域下不容易丢帧。仿真波形里重点展示两路VSYNC差几百个时钟时,输出端照样完整对齐。你目前是卡在FIFO深度计算上,还是对跨时钟域采样没把握?

  • 单片机玩家小刘

    其实换个角度想,面试官问这个题,大概率不是真让你现场把4路1080p的完整代码敲出来——时间不够。他更想听你讲清楚风险和取舍。比如你用了最早路VSYNC做全局触发,那如果最早那路忽然断帧了呢?常见做法加一个超时计数器,超过一帧时间还没等到某路VSYNC就切到次早那路,或者用看门狗复位整个对齐状态机。另一个容易漏帧的点是FIFO读使能控制:千万别直接用组合逻辑把VSYNC接到读使能上,那会读出空数据。应该用读时钟域打两拍同步后的VSYNC上升沿来置位读使能,再用行结束信号清零读使能。我去年帮人改过一份代码,就是读使能没做边缘检测,仿真时看起来对得齐,上板一跑每一帧都少几行。你自己写代码时,建议先用一个双端口RAM加地址计数器模拟每路缓存,等行号匹配逻辑调通了再换成FIFO,调试周期能缩短一半。

  • HDL小白

    这题往深了挖,其实是在考你对视频流时序和跨时钟域握手两个知识域的交叉理解。先说个新手常踩的坑:以为FIFO能自动对齐帧边界,结果出图花屏。FIFO只解决跨时钟域的数据传输速率匹配,不解决帧起始点的对齐。对齐需要你自己在输出时钟域里维护一份行号计数器,每路读FIFO时都带上自己原始的行号标签——我一般做法是在每路FIFO写入时把行号拼接在数据高几位,读出后解析。然后设计一个状态机:等待所有路的VSYNC都到达(或超时),选最早那路的行号作为基准,其余路用比较器判断当前读出的行号比基准大还是小,大就丢弃几行直到追上,小就重复当前行直到基准追上来。这里有个隐含约束:重复行或丢弃行的操作必须发生在消隐区间内,否则画面会出现撕裂。所以实际设计时,每路FIFO的读使能要配合HSYNC的消隐窗口来做,不是随便什么时候都能跳行。时序约束方面,除了异步FIFO那边的跨时钟域约束,还有一个容易忘的是:给行号比较器的组合逻辑设multicycle path,因为行号更新频率是像素时钟的1/1920,组合路径完全可以用两个周期去算。仿真波形里除了看两路VSYNC相位差,还得看行号匹配时的延迟——如果你发现对齐后的输出帧内出现了重复行或缺失行,那大概率是行号比较器的时序没满足或者FIFO深度没覆盖最大偏差。你如果手头有仿真环境,可以先拿两路720p试,把VSYNC故意调成相差一帧半,看输出端能不能撑住。

  • Verilog小白在路上

    手撕这题,面试官其实想看你有没有从系统级角度去解,而不是只盯着FIFO深度算半天。我建议你回答时先画一个分层图:第一层,每路AXI4-Stream进来先通过一个解析模块把VSYNC和HSYNC从数据里剥离出来,这里要注意,AXI4-Stream的tvalid和tready握手可能会让有效数据不连续,所以解析器里得用状态机区分消隐区和有效像素区,不能简单用tlast来切行。第二层,每路挂一个异步FIFO,写时钟用各自输入端的时钟,读时钟统一用输出端的像素时钟,FIFO深度要覆盖两路最大帧周期差乘以每帧总像素数,比如一路30fps一路25fps,差大约3.3ms,1080p一行2200像素(含消隐),算下来深度至少7200,建议留余量到8192。第三层是对齐引擎,我见过一个巧妙的做法:每路FIFO读出数据时在低位补上行号计数器,输出端用最早到达那路的VSYNC置位一个帧起始标志,然后每路各自比较自己的行号与基准行号,超前就重复上一行数据并停止读FIFO一拍,落后就连读两拍追回。这里有个坑:重复行时像素时钟不能停,否则后端DDR或显示控制器会断流,所以重复行期间要复用内部行缓存里的上一行数据,而不是单纯拉低读使能。仿真波形里重点展示两路VSYNC相差200个输出时钟周期时,输出端每行的像素数据依然完整且对齐到同一帧起点。你目前FIFO读时钟域是不是和输出像素时钟同一个时钟源?如果不是,还得加一级CDC同步才行。

  • FPGA实践者

    这道题我去年帮实验室学弟梳理过,发现大家最容易忽略的是AXI4-Stream握手信号对帧对齐的影响,而不是FIFO本身。面试官如果让你现场写代码,我建议你从顶层模块开始写,先别碰底层FIFO实例化。顶层模块的端口就是4个axis接口加1个输出axis,内部例化4个axis_to_fifo模块和一个frame_aligner状态机。每个axis_to_fifo要做三件事:用tvalid和tready的与逻辑作为写使能,解析tuser或tlast来检测VSYNC和HSYNC(具体看协议约定,常见做法是tuser[0]拉高表示帧起始,tuser[1]拉高表示行起始),然后把数据、行号、帧起始标志打包成FIFO的写数据总线。frame_aligner状态机里我建议用三段式:第一段检测所有路的帧起始标志并记录到达时间戳,第二段选最早到达那路作为主路,第三段根据主路的行号计数器调整从路的读指针。这里有一个容易漏帧的细节:当某一路的FIFO处于almost_empty状态时,如果强行让它读两拍来追行号,会读出空数据,所以读使能必须与FIFO的empty标志做与逻辑,同时如果追行号导致读空,就改为插入一行纯黑像素(或者上一行重复)而不是等待,否则输出时序会断。时序约束方面,你需要在综合脚本里对每个异步FIFO的读写时钟域设set_clock_groups -asynchronous,并在同步打拍路径上设set_false_path。仿真波形里除了展示VSYNC对齐,还要抓一行内每个像素的读使能脉冲,确保没有毛刺。如果你现在还没写过完整的axis接口解析模块,建议先拿Xilinx的axi_vip或者Intel的avalon_st仿真模型练手,把tready反压时的数据连续性搞明白。你目前在哪个平台做仿真?Vivado还是Questa?如果是Vivado,用它的xpm_fifo_ip例化异步FIFO会省很多事,但要注意它的prog_full和prog_empty不能直接当读使能用,需要额外边缘检测。

  • 单片机学习者

    校招现场被问到多路视频帧对齐,其实面试官真正想看的不是你把FIFO深度算到多少位,而是你有没有意识到帧对齐这件事本身有多脆弱。我去年帮实验室同学调试过类似项目,发现一个很常见的坑:大家总觉得只要每路都写进FIFO,然后用最早到达的VSYNC统一触发读使能就完事了,结果上板跑出来画面边缘总是花屏。原因很简单——你读使能如果直接用组合逻辑接到VSYNC上,读时钟域下很可能读到空数据,因为写时钟域还没把数据写进去。正确做法是读时钟域先同步两拍检测VSYNC上升沿,再置位读使能,然后用行结束信号清零。还有一个容易被忽略的点是超时保护:如果最早那路忽然断帧了,你的对齐状态机会一直等下去,整帧画面卡死。加一个超时计数器,超过一帧时间还没等到某路VSYNC就自动切到次早那路,或者直接复位整个对齐引擎。代码框架上,建议每路先用一个axis_to_fifo模块解析出VSYNC和HSYNC,打包成带行号的数据写入异步FIFO,然后在输出时钟域里用一个frame_aligner状态机做行号匹配。仿真波形要重点展示两路VSYNC相差几百个周期时,输出端依然能完整对齐。你目前是在写代码阶段还是已经上板调过了?

  • 电子工程学生

    这道题如果只答FIFO缓存加VSYNC对齐,面试官会觉得你只背过八股。往深了说,真正决定漏不漏帧的关键在于你对AXI4-Stream握手信号和消隐区时序的理解,而不是FIFO本身。先说一个常见误区:很多人以为tlast就代表一行结束,直接用它来切分数据,但AXI4-Stream的tvalid和tready握手可能导致有效数据不连续,tlast只在最后一拍有效,中间如果tready拉低了几拍,你拿tlast做行计数器会漏掉行号。正确做法是写一个状态机,在有效像素区用tvalid&tready的与逻辑累积像素计数,检测到tlast后判读该行是否完整,再决定是否递增行号。对齐逻辑的核心其实不是FIFO深度——1080p一行2200像素(含消隐),4路帧率差按30fps对25fps算,最大差约3.3ms,深度算下来8192足够——真正的难点在于输出端如何让不同路的数据在消隐区间内完成跳行或重复行操作。如果你在有效像素区做跳行,画面会撕裂;必须在HSYNC拉低后的消隐窗口内,利用那几行空白时间调整读指针。我建议你代码结构上分三层:第一层是每路的axis_parser,剥离VSYNC/HSYNC并打包成{行号,像素数据}的格式;第二层是异步FIFO,写时钟用各自输入时钟,读时钟统一用输出像素时钟,深度8192,注意例化时要使能prog_full和prog_empty,方便读端判断缓存水位;第三层是frame_aligner,用三段式状态机,状态包括IDLE(等待所有路VSYNC)、ALIGN(行号匹配,落后就丢弃、超前就重复)、OUTPUT(正常输出),每路行号比较器用减法器实现,差值大于阈值则触发跳行。时序约束方面,同步器上设false path,FIFO读写时钟域之间设set_clock_groups -asynchronous。仿真时重点构造两路VSYNC相差200个时钟周期的case,看输出端是否能对齐且不丢行。你目前有试过用双口RAM代替FIFO做调试吗?那个方法能帮你更快定位行号匹配逻辑的bug。

登录后可在本页底部提交回答

提问者

Web新手查看主页
浏览「其他」

描述场景与已尝试方案,更容易获得有效解答

相关问题

同分类

提问建议

  • 标题写清核心疑问,避免「求助」「请问」等空泛用语
  • 正文补充环境、版本、报错信息或截图
  • 先搜索本站是否已有相近问题,减少重复提问
  • 若与课程相关,请标明课时或章节便于讲师定位