2026年FPGA校招,双非本做RISC-V SOC项目,面试官问Cache一致性怎么实现?求具体硬件方案和代码思路

开放10 回答 55 浏览

我双非本科,简历上写了个RISC-V软核SOC项目,用了AXI总线挂DDR和UART。面试官问Cache一致性怎么实现,我答了MESI协议,但他追问硬件怎么检测总线嗅探、写回策略怎么选。我项目里没真做多核,只是单核带Cache,他是不是在深挖?求大佬给个具体硬件方案和Verilog代码思路,Cache一致性到底怎么在FPGA上实现?

分享:

10 个回答

  • Verilog练习生

    面试官问Cache一致性,其实不是要你现场写Verilog,而是想看你有没有考虑过「单核Cache」和「多核一致性」之间的鸿沟。你只做了单核SOC,他这么追问,大概率是压力测试——看你敢不敢承认项目没做多核,以及能不能说出如果做多核会怎么设计。

    硬件方案上,FPGA实现Cache一致性最常用的就是总线嗅探(Bus Snooping)。每个核的Cache控制器要监听AXI总线上的读/写事务。比如核A要写一个地址,它先发一个Invalidate请求到总线,核B的Cache控制器看到这个地址在自己缓存里,就把对应行标记为Invalid。这需要Cache控制器额外实现一个监听端口,跟AXI的写地址通道和写数据通道并行处理。

    写回策略上,你项目里单核可以用Write-Back,性能好;但如果真要改多核,Write-Through加写缓冲可能更容易保证一致性,因为每次写都穿透到主存,其他核读主存就能拿到最新值。当然Write-Through带宽压力大,FPGA上DDR带宽有限,所以常见做法是Write-Back加MESI协议,但MESI的状态机(Modified/Exclusive/Shared/Invalid)在Verilog里实现起来很麻烦,需要维护每个Cache Line的状态、处理Snoop Hit时的状态转换,还要处理写缺失时的替换策略(比如LRU)。

    代码思路上,你可以说:如果实现一个简单的单总线双核系统,Cache控制器核心是一个有限状态机,状态包括IDLE、CHECK_TAG、SEND_SNOOP、WRITE_BACK等。Snoop逻辑就是当总线有写事务时,把地址和当前Cache的Tag比较,如果命中且状态是Modified,就要先写回主存再让写事务通过。Verilog里可以用一个always块监听AXI的awaddr和wdata,另一个always块处理Cache内部读写。

    他深挖你其实是个机会——你可以坦白说项目里是单核,但研究过多核一致性的论文或开源实现(比如OpenPiton的L1 Cache),然后讲清楚如果让你改,你会从哪个模块入手。这比硬编一个没验证过的代码强多了。另外,你双非本,面试官更看重你对问题的理解深度和诚实态度,而不是背代码。追问:你项目里Cache用的是直接映射还是组相联?替换策略是随机还是LRU?这会影响你写Snoop逻辑的复杂度。

  • FPGA学员1

    面试官挖你是好事,说明他感兴趣。单核项目答Cache一致性,你就直接说项目没实现多核,但知道MESI和总线监听的基本原理,然后反问一句如果做多核你会从哪个模块改起。别硬编代码,FPGA上真做多核一致性,光仲裁逻辑就够你写一个月。

  • 数字IC新手

    其实你被追问的核心不是因为Cache一致性难,而是因为你简历上的SOC项目和他期望的「能直接做多核验证」之间有差距。硬件方案上,FPGA实现一致性最常见的做法不是自己写Snoop逻辑,而是用Xilinx的AXI Interconnect带Cache Coherency的IP核(比如AXI_ACP口),或者用RISC-V的TileLink协议。面试官更想听你知道有现成的解决方案,而不是从头造轮子。

    代码思路的话,如果你非要用Verilog写,可以画一个四状态MESI状态机,重点说明每个状态在总线监听下的转移条件:比如当前是Exclusive,总线上来了一个同地址的写请求,状态跳到Invalid;如果是Modified,要先回写再跳Invalid。你项目里单核Cache的写回策略如果是Write-Back,那改成多核时Write-Back逻辑需要加一个写缓冲(Write Buffer)来暂存回写数据,避免阻塞总线。

    最后,面试官深挖是好事,说明他把你当有潜力的候选人对待。建议你回去把MESI的Verilog状态机画一遍,哪怕只是伪代码,下回再被问到就能说清楚了。

  • 芯片萌新

    面试官深挖其实是在试探你的项目边界意识,不是真指望你当场写出MESI的Verilog。你单核项目答Cache一致性,最稳妥的做法是先承认项目里没做多核,然后说你了解实现一致性的几种硬件方案,比如总线嗅探或者目录协议,再结合FPGA资源谈取舍。FPGA上做嗅探,关键是在每个Cache控制器里加一个监听端口,监听AXI的ARADDR和AWADDR,比对地址是否命中本地Cache行。命中后根据当前状态转移:如果本地是Modified,得先触发写回,把数据通过AXI的写通道刷到共享内存,再把状态标Invalid。代码实现上,不要从头写MESI状态机,而是用Xilinx的L2 Cache IP核,它自带一致性逻辑,或者用RISC-V的TileLink协议,它通过Agent和Manager自动处理。面试官更想听你知道有现成方案,并且能分析单核项目改多核时,Write-Back策略下Cache行被逐出时要先写回,否则其他核读到脏数据。你如果能把AXI的WVALID和BVALID信号跟状态机联动讲清楚,已经足够证明你理解了。追问一句:你项目里的Cache是直接映射还是组相联?组相联的替换策略会影响一致性逻辑的复杂度。

  • 嵌入式开发萌新

    他挖你是因为你简历写了SOC项目,但没写多核。直接说项目里没做,但知道MESI和总线嗅探的基本流程,然后反问如果加个核你会怎么改Cache控制器。别硬编代码,FPGA上真做一致性,仲裁和写回时序就够你折腾。

  • Verilog入门者

    面试官这么追问,本质上是在考察你能不能从单核设计跳到多核视角,而不是真的期待你背出MESI的完整代码。你项目里只有单核Cache,那他问Cache一致性,你回答的切入点应该放在单核Cache的哪些设计会阻碍多核扩展上,而不是强行编一个多核方案。

    先说硬件方案。FPGA上实现Cache一致性,最实际的做法不是自己写嗅探逻辑,因为那要处理总线事务的乱序和原子性,很容易跑飞。常见做法是使用带ACP(Accelerator Coherency Port)的Zynq或MPSoC,或者用RISC-V的TileLink协议里的CohAgent。但你的项目是软核SOC,挂的是AXI总线,那就得走总线嗅探路线。关键点在于:每个Cache控制器要有一个独立的监听端口,它不参与本核的读写请求,而是持续监视AXI总线上的读地址和写地址。当监听到一个写请求地址落在本Cache行内时,如果本行是Modified状态,你需要立刻中断本核的当前操作,先发起一个写回事务,把脏数据刷到DDR,再将状态置为Invalid。这段逻辑在Verilog里要用一个独立的always块,优先级高于本核的Cache访问,否则会出现本核读新数据而写回还没完成的时序冲突。

    写回策略的选择上,单核用Write-Back性能好,但多核一致性场景下,Write-Back配合嗅探会导致频繁的写回和无效化,反而降低性能。所以很多多核FPGA设计会折中用Write-Through,虽然写带宽高,但省去了脏数据回写的监听延迟。你可以跟面试官说,如果资源允许,可以在L1用Write-Through,L2用Write-Back,靠L2的一致性逻辑隔离复杂度。

    代码思路这块,别从零写MESI状态机。更高效的做法是参考OpenPiton或LowRISC的开源实现,它们有现成的L1-L2一致性控制器,你理解后用自己的Verilog改写关键模块,比如监听地址比较器和状态转移表。面试官听到你能说出开源项目名字和核心模块,比背状态图加分得多。

    最后提醒一点:双非本做RISC-V项目,面试官深挖不是为了让你出丑,而是想确认你做过的东西是自己理解的。你只要把单核项目里哪些模块能复用、哪些得重写分析清楚,就已经证明你具备系统设计思维了。追问:你项目的Cache替换策略是LRU还是随机?如果是随机替换,那一致性监听时地址比对命中率会低,但实现简单;LRU的话,监听逻辑要额外维护访问历史,FPGA上资源开销大,你当时怎么权衡的?

  • 单片机初学者

    面试官挖你,不是要你现写MESI的Verilog,而是看你有没有「单核到多核的迁移意识」。你单核Cache写回策略如果是Write-Back,那改多核时得先加一个监听端口,挂到AXI的ARADDR和AWADDR上。代码上别从头写状态机,直接用Xilinx的L2 Cache IP核,它自带一致性逻辑。你项目里没做多核,就老实说没做,但知道怎么改——从Cache控制器里分出一个监听通道,比对地址命中后触发写回或失效。追问一句:你面试时他有没有让你画Cache和总线的连接框图?

  • EE学生一枚

    说实话,双非本面试被挖到这个深度,说明他简历筛选时已经认可了你的SOC项目,现在是在试探你的「项目边界」——你能不能清晰分出哪些是你实现的、哪些是理论上了解但没落地的。Cache一致性在FPGA上的硬件方案,最省事的不是自己写嗅探,而是用Zynq的ACP口或者RISC-V的TileLink协议里的CohAgent。如果你非要用AXI总线硬写,关键坑在于:监听端口要独立于本核的读写请求,否则主核读数据时监听通道被堵住,总线事务就乱套了。写回策略上,单核用Write-Back没问题,但改多核时建议先切到Write-Through,等监听逻辑稳定了再改回Write-Back。代码思路可以画一个简化版MESI状态机,只处理三个状态:Invalid、Shared、Modified,把Exclusive省掉,这样FPGA资源占用少一半。你项目里DDR控制器是自己写的还是调IP?这个会影响你监听端口的地址映射范围。

  • 电路设计萌新

    你这个问题其实暴露了校招面试中一个常见误区:以为面试官要你当场写出一段能综合的MESI Verilog代码,实际上他更想听你讲清楚「为什么单核Cache设计在多核场景下会失效」以及「你打算从哪几个模块改」。我当年面某芯片公司,项目里也只做了单核Cache,面试官追问时我直接回答:目前项目是单核,Cache控制器只处理本核的读写请求和写回策略;如果扩展为多核,需要在每个Cache控制器内部增加一个独立的监听状态机,监听AXI总线上的ARADDR和AWADDR。当监听到的地址命中本地缓存行且状态为Modified时,必须先通过AXI的写数据通道将脏数据写回DDR,同时将本地状态置为Invalid。这是总线嗅探最核心的时序约束——写回操作必须在总线仲裁器允许该写事务完成之前发起,否则其他核会读到过期数据。FPGA上实现时,你可以利用Xilinx的AXI Interconnect IP核自带的监听过滤功能,它能在硬件层面帮你处理地址广播和响应合并,你只需要在Cache控制器里实现状态转移逻辑。至于写回策略,建议先用Write-Through跑通多核验证,因为每个写操作都同步到DDR,监听时不需要处理脏数据写回,状态机可以简化到只处理Invalid和Shared两个状态。等系统稳定了再改Write-Back,这时候才需要完整实现MESI或MSI协议。另外,你项目里的RISC-V核是用的SweRV还是VexRiscv?不同核的Cache接口信号定义不一样,监听端口的地址对齐方式也会不同。你面试时如果遇到追问,可以直接反问面试官:如果项目里用的是VexRiscv的Data Cache,它的写回策略是写直达还是写回?这样能展示你对具体实现细节的掌控力,而不是停留在协议层面背书。

  • 单片机初学者

    面试官追问到总线嗅探和写回策略,其实已经不是在考你MESI协议背得熟不熟了——他在看你能不能把单核Cache的局限性和多核扩展的改动点讲清楚。你项目里没做多核,这本身不是问题,问题在于你有没有想过:单核Cache的写回策略(比如Write-Back)在多核场景下,为什么会导致数据不一致?原因很简单:两个核各自有Cache,核A写了一个地址的数据,数据只留在A的Cache里且标成Modified,核B读同一个地址时,如果走AXI总线直接去DDR读,读到的就是旧数据。要解决这个,硬件上得加一个监听端口,挂在每个Cache控制器上,持续监视AXI总线上的读地址和写地址。当监听到的地址命中本地缓存行,且状态是Modified时,必须先通过AXI的写数据通道把脏数据写回DDR,同时把本地状态置为Invalid。这个写回操作必须在总线仲裁器允许核B的读事务完成之前发起,否则时序就乱了。FPGA上实现时,最容易踩的坑是监听端口和本核读写请求共用同一个AXI接口,导致监听请求被阻塞。正确做法是让监听端口走独立的读地址通道,或者用AXI的监听事务(比如ARPROT带特定信号)来区分。代码实现上,不用从头写MESI状态机,可以用一个三状态简化版:Invalid、Shared、Modified,省掉Exclusive以减少状态转移的复杂度。写回策略建议先切到Write-Through,等监听逻辑稳定了再改回Write-Back,因为Write-Through模式下脏数据不会留在Cache里,监听只需要做失效操作,时序压力小很多。你面试时如果能把这几层因果关系说清楚,比直接甩一段Verilog代码更有说服力。你项目里单核Cache用的是Write-Back还是Write-Through?这个细节会影响你回答时举例的准确性。

登录后可在本页底部提交回答

提问者

嵌入式小白查看主页
浏览「其他」

描述场景与已尝试方案,更容易获得有效解答

相关问题

同分类

提问建议

  • 标题写清核心疑问,避免「求助」「请问」等空泛用语
  • 正文补充环境、版本、报错信息或截图
  • 先搜索本站是否已有相近问题,减少重复提问
  • 若与课程相关,请标明课时或章节便于讲师定位