我是双非硕士,2026年FPGA春招投了海思、比特大陆、紫光展锐,简历上写了个RISC-V软核SOC项目,带AXI4总线、Cache、UART、SPI外设,但面试官每次问RTL级实现细节我就卡壳,比如Cache替换策略的硬件实现、总线仲裁的优先级设计。求真实面经,面试官会深挖哪些Verilog代码细节?怎么准备才能拿到40W+的offer?
2026年FPGA春招,双非硕士简历上写了个RISC-V软核SOC项目,面试官会深挖哪些RTL级细节才能拿到40W+?
10 个回答

看到你写的SOC带AXI4和Cache,面试官大概率会先让你画Cache状态机的状态转移图,然后追问MESI协议里Modified和Exclusive状态在写缺失时的处理差异。一个常见的坑是,很多人只记得状态名但说不清硬件上怎么用Valid、Dirty两个标志位组合出四个状态。建议你直接在纸上写出三段式状态机的Verilog代码,重点说明状态跳转条件里,总线snoop信号和CPU访存请求的优先级怎么仲裁。另外,AXI4的outstanding传输里,乱序返回的ID管理才是真正的难点——面试官可能会问,如果两个写请求发出去,先发的被后返回的数据覆盖了怎么办。你可以在仿真波形里展示ID匹配逻辑,比如用FIFO缓存写数据然后按ID重排。一个小技巧:准备一个具体场景,比如Cache miss后从内存取数据时,AXI的RLAST和RVALID握手时序怎么影响状态机,能讲清楚这个基本就过关了。对了,你跑过带AXI VIP的仿真吗?没有的话建议用VCS或Xsim搭个简单testbench,把波形抓出来当面试素材。

双非硕想拿40W+,光靠简历上的项目名是不够的,面试官要听的是你踩过哪些坑、怎么权衡面积和性能。以你写的Cache为例,别只背MESI协议,要能说清楚:为什么你的设计里用的替换策略是伪LRU而不是真LRU?真LRU在硬件上需要维护全相联的比较器阵列,32路cache光比较器就要3000多个LUT,而伪LRU用二叉树加少量寄存器就能实现,代价是替换准确率下降约5%。面试官听到这个层面的取舍,才会觉得你真的调过综合报告。总线仲裁也是类似,固定优先级还是轮询?如果选轮询,你考虑过连续多个高优先级请求时延迟抖动怎么控制吗?常见做法是加权轮询,但权重系数得根据实际外设带宽需求调,比如UART只需要1MB/s,而DMA可能要到几百MB/s,你代码里写死权重还是做成可配置寄存器?这些细节比单纯讲状态机值钱得多。另外,AXI4乱序处理这块,你可以准备一个具体波形:比如CPU连续发出读A和读B,但内存控制器先返回B的数据,你的设计里怎么保证写回Cache时数据不乱?用AXI的ID位做tag匹配是最直接的,但ID位宽有限,如果outstanding深度超过16,就得自己维护一个重排序缓冲区。这些实现上的权衡和代价,才是决定你能不能拿高薪的关键。你目前的仿真环境是自己搭的testbench吗?有没有试过用SystemVerilog的随机约束来验证乱序场景?

别只背状态机名字,面试官随便问个写缺失时Dirty位怎么更新你就卡住了。直接拿笔写一段Cache控制器的Verilog,把Valid、Dirty、Tag、Data四部分怎么组合逻辑输出讲清楚,比背十遍MESI有用。你AXI的ID乱序处理仿真过吗?没波形的话面试官会觉得你只是搭了个架子。

说实话,你简历上的AXI4和Cache在面试官眼里就两个价值点:一是你能不能把状态机写成可综合的RTL,二是你能不能讲清楚硬件上为什么这么选。我建议你别再背MESI协议的状态名了,直接拿笔写一段Cache控制器的Verilog,把Valid、Dirty、Tag、Data四部分怎么组合逻辑输出讲清楚。面试官大概率会追问:当CPU写缺失时,如果当前Cache Line是Modified状态,你得先把脏数据写回内存再加载新数据,这个写回操作和AXI的写事务怎么衔接?你的状态机里有没有为这个写回单独设一个WB状态?很多人在这里就卡住,因为他们只画了MESI的四状态图,没考虑AXI的握手延迟。更深一层是AXI的outstanding乱序处理:比如你Cache miss发了两个读请求,地址不同,返回时ID顺序乱掉了,你重排序的FIFO深度设多少?如果深度设4,但实际有5个outstanding,你代码里是直接报错还是做反压?面试官想听的不是你背协议,而是你调仿真波形时踩过的坑——比如重排序逻辑里写指针和读指针的跨时钟域同步,你用两级触发器还是异步FIFO?后者面积大但吞吐高,你权衡过吗?建议你找个具体的场景,比如一个Cache miss后AXI的RLAST信号和RVALID的时序关系,在波形里标出来,比说十遍协议管用。另外,你总线仲裁如果选了轮询,面试官可能会问:连续多个高优先级请求时延迟抖动怎么控制?常见做法是加权轮询,权重系数根据外设带宽需求调,比如UART只需要1MB/s,DMA可能到几百MB/s,你代码里写死权重还是做成可配置寄存器?这些取舍比单纯讲状态机值钱得多。你现在处于什么阶段?是刚开始刷题还是已经投了几家?如果还没开始,建议先拿一个完整的仿真波形图,把Cache状态机每拍的变化和AXI事务的ID对应关系标出来,面试时直接亮图,比说一堆空话有说服力。

面试官问Cache替换策略时,别只说LRU。直接提伪LRU的硬件实现:32路Cache用真LRU需要维护全相联比较器,LUT消耗大;伪LRU用二叉树加少量寄存器就能实现,替换准确率只下降约5%。你项目里选了哪个?为什么?能说清这个取舍,面试官就知道你调过综合报告。AXI4的ID乱序处理也一样,你FIFO深度设多少?深度4但实际5个outstanding时代码怎么处理?这些细节比背协议值钱。先把你波形图上Cache状态转换和AXI事务ID对应关系标出来,面试时直接摆图。

Cache替换策略面试官就听你讲伪LRU和真LRU的LUT消耗对比,AXI乱序就看你FIFO深度和反压逻辑。波形图比背协议有用,直接亮图吧。你目前仿真环境是Vivado还是VCS?这会影响你调试效率。

面试官看Cache,核心就两个:替换策略的硬件代价和MESI状态机里Valid/Dirty的时序。你写个伪LRU的二叉树实现,再贴个AXI乱序返回时ID重排的波形,比背十遍协议有用。

说实话,双非硕想拿40W+,面试官对你的期待不是背MESI状态名,而是能现场画出一段可综合的Cache控制器代码。我建议你重点准备两个场景:一是写缺失且当前Line是Modified时,你状态机里怎么把脏数据写回AXI总线再取新数据——很多人没单独设WB状态,结果写回和读请求的握手时序打架。二是AXI的outstanding乱序处理,比如你发了两个读请求,地址不同,ID分别是0和1,返回时ID1先到,你的读数据FIFO是按地址顺序重排还是按ID匹配?常见做法是用一个深度等于outstanding数的FIFO存RID和地址映射,再根据返回的RID查表取数据,但这样LUT消耗大。面试官可能会追问:如果outstanding深度设4,实际发了5个请求,你的代码会不会漏ID?你可以在波形里标出一个ID被两次使用的场景,说明你的ID分配器是怎么防重用的。另外总线仲裁的优先级设计,别只说轮询,面试官会问:连续三个高优先级请求时,低优先级外设(比如UART)的延迟抖动怎么控制?你可以在代码里加一个可配置的权重寄存器,或者用time-slot方式给每个外设固定时间片。准备时把这三个点的波形截图和RTL关键段整理成PDF,面试直接亮图,比简历上的项目描述有说服力。对了,你仿真环境是Vivado还是VCS?不同工具对AXI IP核的支持不一样,会影响你调波形的效率。

个人感觉你被卡壳,不是因为项目不够,而是没把RTL细节落到可验证的例子上。比如Cache,你直接写一个场景:CPU连续读两个地址,第一个读缺失触发写回脏数据,第二个读命中但Cache Line正在被写回总线——这时你的状态机怎么处理读请求的等待?很多人会漏掉AXI的写事务未完成时读请求被阻塞的时序。建议你花两天时间,用Vivado跑一个带AXI VIP的仿真,把Cache状态转换和AXI事务ID的对应关系标在波形上,面试时直接说:这里我的Valid信号在WB状态拉低,等AXI的BVALID返回后才拉高,然后跳转到读缺失状态。这种代码级细节,比讲十遍MESI协议值钱。你目前Cache替换策略用的是伪LRU还是真LRU?这个取舍直接影响LUT消耗,面试官大概率会问。

说实话,面试官看你的RISC-V SOC项目,最想听的不是你调通了UART收发,而是你在Cache状态机和AXI乱序处理上踩过坑。40W+的offer对应的是能独立解决总线时序冲突的人,不是搭积木的。我建议你重点准备一个场景:CPU连续两次读缺失,第一次读缺失触发Cache Line写回脏数据,此时AXI写事务还没完成(BVALID没返回),第二个读请求来了——你的状态机怎么处理?很多人直接把第二个读请求挂起,但没考虑AXI写通道和读通道的独立握手,结果写回和读请求的地址相位冲突。正确的做法是在状态机里单独设一个WB_WAIT状态,在WB状态拉低Valid信号,等AXI的BVALID返回后再跳转到读缺失状态,同时用存储的地址重新发起AR通道读请求。这个细节你可以在Vivado里跑一个带AXI VIP的仿真,把Cache状态转换和AXI事务ID的对应关系标在波形上,面试时直接亮图说:这里我的Valid信号在WB状态拉低,等BVALID后才拉高。这种代码级波形比背十遍MESI状态名值钱。你目前仿真环境是Vivado还是VCS?这会影响你调试AXI乱序返回时的波形抓取效率。
发表回答
登录后可在本页底部提交回答