最近面了几家做AI加速卡的公司,面试官抓着AXI4协议往死里问,什么outstanding、burst、乱序返回、WID和AWID的关系,我项目里全是调Xilinx和国产FPGA的IP核,根本答不上来。现在手里有个offer但薪资不满意,想冲一下大厂。求问各位大佬,AXI协议到底要掌握到什么程度?有没有什么快速上手的方法?
2026年了,FPGA工程师面试被问AXI总线协议细节,项目里只调过IP核没手写过,怎么补才能不被问倒?
9 个回答

说实话,你这个处境我太熟了,当年我也是调了两年IP核,面试被问到AXI的outstanding机制时脑子一片空白。给你的建议是别从头啃协议文档,那玩意儿看三页就困。直接走这条路:先死磕AXI4-Lite,把AW、W、B、AR、R五条通道的握手关系画到闭着眼都能默写,尤其是VALID和READY谁等谁的四种情况,这是地基。然后上AXI4 full,重点理解burst的INCR和WRAP模式,以及为什么要有outstanding——简单说就是master不等前一笔完成就发下一笔,用来掩盖访存延迟,面试官问这个就是想看你对性能瓶颈有没有概念。最后手写一个简单的AXI slave,不用全功能,能响应单笔burst、支持两个outstanding交易就够了,用Xilinx的AXI VIP或者开源代码对着改都行。写的时候你会自然遇到WID和AWID的问题——记住AXI4里WID已经废弃了,靠通道顺序保证写数据顺序,AWID只在乱序返回时用来标识事务,面试官喜欢拿这个钓鱼。另外乱序返回你不需要真去实现,能画出时序图、解释清楚为什么ID能区分不同事务就行。一个容易被忽略的点:面试官常问如果slave没准备好,READY拉低时数据会不会丢,答案是握手协议保证不丢,但你要说清楚是等在哪一拍。再有就是国产FPGA的AXI实现可能和Xilinx有些微差别,但协议层是一致的,别慌。你现在手里有offer保底,心态其实比裸奔好很多,每天抽两小时,一周能搞定。对了,你面试的AI加速卡方向,他们会不会更看重你对AXI互联拓扑里多个master仲裁的理解?这个要不要也提前准备下?

兄弟,别慌。面试官问AXI不是为了让你背协议,是想听你说清楚握手、burst、outstanding这三个词背后的设计动机。你调过IP核,其实已经见过了,只是没归纳。去B站找个讲AXI时序的视频,1.5倍速看两遍,再自己画一遍读通道时序图,基本就能应付了。大厂问得深的概率不大,重点看你有没有工程直觉。

我建议你把这件事当成一次「补认知」而不是「补知识点」,因为面试官真正要考察的,是你有没有能力在芯片验证或系统集成出问题时,顺着AXI这条线把问题定位到具体信号上。只调IP核的人,遇到性能上不去,第一反应是换更大的DDR或者加缓存;而熟悉AXI的人会先看AWLEN和AWLEN算出来的burst长度是否匹配slave的接受能力,再看outstanding的窗口是不是被某个慢速master堵死了。这就是差距。具体怎么补,我给你一条主线:以「一笔写事务的生命周期」为线索走一遍。从master拉高AWVALID开始,slave什么时候拉AWREADY?如果slave正在处理上一笔,它能不能暂时不拉READY?能。这样AW通道就形成了一个背压机制。接着W通道,数据一拍一拍走,WLAST标志最后一拍,slave收齐后回BVALID,master再回BREADY,一笔事务结束。你顺着这条线想清楚为什么需要AW和W分开——因为地址和数据的准备时间不一样,分开可以提前发地址、后发数据,这就是「解耦」。想清楚这个,你对AXI的理解就从背时序图上升到了懂设计意图。然后你再去想outstanding,本质就是允许AW通道比W通道领先多笔,让slave提前知道后面要来什么,可以提前调度。乱序返回则是AR通道发给多个slave、或者同一slave处理不同ID事务时,R通道可以按任意顺序回来,靠ARID来区分。你把这个逻辑捋顺了,面试时哪怕被问到「WID为什么删了」,你也能答出「因为W通道是严格按序的,不需要ID来标识」。最后给你一个实操建议:别用纯手写,直接拿Xilinx官方的AXI4-Lite Slave模板改,那个模板把通道状态机都搭好了,你只需要填充逻辑。改完跑一遍仿真,看波形里VALID和READY的握手关系,比看十遍文档都管用。你既然手里有offer,心态上可以更从容,就当是给自己多长一层本事,而不是被逼着背题。你目前准备时间大概有多少?如果只有一周,我建议优先级是:握手时序图 > burst理解 > 乱序返回概念 > 手写slave,后两个可以只画图不写码。

你现在的状态其实很典型,调IP核和手写协议之间差的那层窗户纸,就是「从用户视角切到设计者视角」。调IP核时你看到的是接口和时序图,但面试官想确认的是你知不知道AXI为什么长这样。我的建议是别急着去啃协议文档,先抓住一个核心矛盾:AXI是并行通道加握手背压的架构,它所有看似复杂的机制——outstanding、乱序返回、多ID——本质上都是在解决「访存延迟怎么隐藏」和「多笔事务怎么不互相堵死」这两个问题。你从AXI4-Lite入手是对的,因为它的单笔事务把五通道的握手关系暴露得最干净,你画一遍AWVALID和AWREADY谁等谁的四种情况,就理解了背压的本质。接下来上AXI4 full,重点看INCR burst的地址计算和WLAST什么时候拉高,然后想一个问题:如果一笔burst还没传完,另一笔的AR通道请求来了,master能不能不等?如果能,就产生了outstanding。面试官问乱序返回,其实是在问WID和AWID的关系——为什么W通道要有ID而R通道也要有ID,就是因为多笔事务在数据通道上可以交错返回,ID就是用来区分哪笔数据属于哪个事务的。你不需要完整实现一个高性能AXI slave,但至少要手写一个支持两笔outstanding、能响应单笔burst的简化版,用Xilinx的AXI VIP做激励,自己看波形里ID和VALID/READY的配合。最后面试时能画出读通道和写通道的时序图,把ID、LAST、RESP这几个信号标出来,基本就过关了。另外有个小技巧:面试官问「为什么WID在AXI4里被去掉了」,你可以答因为写数据通道必须严格按顺序发送,所以不需要ID区分,这比死记结论更能体现你理解了协议演进。你打算留多少时间准备?如果只有一两周,建议集中火力在握手和burst上,乱序返回能讲清原理就行。

补AXI最快的方式不是看文档,是找一段开源的AXI slave Verilog代码,比如GitHub上那些教学用的,打开波形仿真,把AWVALID、WVALID、BVALID三条信号的先后关系看明白。你先别管outstanding,把单笔写事务从AW通道发地址、W通道发数据、B通道回响应这三步走通,再去看读事务的AR和R通道,你就会发现读和写最大的区别是读没有独立的响应通道,数据本身带着RESP。搞清楚这个之后,再回头想outstanding其实就一句话:master不等前一笔的B或R回来,就发下一笔的AW或AR。面试时能把这个串起来讲,比背十个协议条目有用。你目前是打算一边上班一边准备跳槽,还是先辞职脱产冲一把?

你现在的处境其实不是「没写过 AXI」,而是「没见过 AXI 的底层动机」。调 IP 核就像开自动挡,面试官想确认你会不会开手动挡。所以补的顺序应该是:先搞懂为什么 AXI 要把读写拆成五个通道,而不是像 AHB 那样共用一个总线。你想想,如果读和写共享一组地址和数据线,那读数据回来的时候,写地址就得等,延迟就藏不住。AXI 拆成独立通道,本质上是让每一笔事务的「请求」和「响应」都能并行流动,这是 outstanding 能成立的前提。你从 AXI4-Lite 入手是对的,因为它把五通道的握手关系暴露得最干净:AWVALID 和 AWREADY 谁先拉、谁等谁,画一遍四种情况就懂了背压。然后上 AXI4 full,重点看 INCR burst 的地址怎么算、WLAST 什么时候拉高,再想一个问题:如果一笔 burst 还没传完,另一笔的 AR 请求来了,slave 怎么处理?这时候你就会发现,其实 slave 不需要真的乱序返回,只要 master 支持多 ID,它就能把不同 ID 的事务分开管理。面试时不用背 WID 和 AWID 的对应关系,你只要说清楚「WID 是写数据通道用来标识这笔数据属于哪笔写事务的,AWID 是地址通道用来标识写事务本身的,两者必须匹配,否则 slave 无法把 W 数据路由到正确的写缓冲区」,这就够了。最后手写 slave 的时候,别贪多,先写一个能响应单笔 burst、支持两个 outstanding 的版本,用 Xilinx 的 AXI VIP 或者开源代码对着改,你会发现原来最难的不是协议本身,而是怎么处理「当 AW 和 W 通道的握手不在同一拍完成时,你的状态机怎么跳」。你目前是打算先接了这个 offer 再骑驴找马,还是想再拖一拖直接冲大厂?

别啃协议文档,直接去 B 站找个 AXI 时序动画,把 AWVALID 和 WREADY 的握手看明白,再自己画一遍读通道,基本就能糊弄过去了。outstanding 就一句话:不等上一笔回来就发下一笔。

个人感觉你缺的不是协议知识,是「把 IP 核的行为翻译成信号级语言」的能力。补的时候别按文档顺序走,按事务生命周期走:一笔写事务从 AW 通道发地址开始,slave 拉 AWREADY 表示接受,然后 W 通道一拍一拍传数据,WLAST 表示最后一拍,slave 收齐后回 BVALID。你把这个流程用波形画出来,再对比读事务——读没有独立的响应通道,数据本身带着 RESP,所以读的乱序返回比写更常见。面试问 outstanding,你就说它本质是「用多笔未完成事务掩盖访存延迟」,但代价是 slave 需要更大的缓冲和更复杂的仲裁。能把这个 trade-off 讲清楚,比背十个协议条目有用。至于 WID 和 AWID,你就说 WID 是给写数据通道用的路由标签,AWID 是给地址通道用的,两者必须一致,否则数据不知道往哪放。你画过时序图之后,会发现这些概念全是连在一起的,不用死记。

你现在的处境,我猜是这么个状态:IP核的GUI界面和时序图都熟,但一被问到VALID和READY谁先拉,脑子就开始转不动。这很正常,因为调IP核时你看到的是封装好的行为,而面试官想看的是你拆开封装后还能不能讲清楚里面的因果链。我建议你别按文档顺序补,按「一笔事务怎么死」的思路来。拿写通道举例,最核心的其实是背压:AWVALID拉高了,但slave的AWREADY一直不拉,这笔地址就在通道里悬着,这叫等待。你把这个等待画出来,再想如果slave的接收缓冲满了,它能不能让W通道也停?能,因为WREADY也可以不拉。那问题来了:地址通道和数据通道是独立的,地址被接受了但数据还在传,这时候如果再发一笔新地址,就形成了outstanding。你把这个链条想通,其实AXI的很多细节都能串起来。至于WID和AWID,你只要记住WID是跟着数据走的标签,AWID是跟着地址走的标签,两者必须配对,否则数据就不知道属于哪笔事务。面试时你甚至可以主动画一下:如果master发了两个不同ID的写事务,slave先回了后发的BVALID,这就叫乱序返回。你能画出这个场景,比背十条协议条目都管用。最后说手写slave这件事,别一上来就写全功能,先写一个能处理单笔INCR burst、支持两个outstanding的简化版,用开源代码对着改,跑通仿真就算过关。你手里那个offer如果薪资差得不多,我建议先接着,边上班边准备,因为脱产冲大厂的心理压力反而容易让你在面试时发挥失常。你现在是主要想补协议细节,还是更担心现场手撕代码?
发表回答
登录后可在本页底部提交回答