最近刷牛客和CSDN,发现2026届FPGA/IC校招笔试里,AXI4-Lite从机实现几乎成了必考题。很多人状态机写得没问题,但一到AWVALID/AWREADY、WVALID/WREADY这些握手信号的依赖关系就乱套,要么死锁要么丢数据。想问下这类题到底该怎么拆解?有没有推荐的刷题顺序和手写模板?
2026年FPGA校招笔试里「用Verilog实现AXI4-Lite从机寄存器组」这类题,为什么很多人卡在握手信号而不是状态机?
8 个回答

先说结论:卡握手不是因为状态机难,而是因为很多人把 AXI 当成「带几个 valid 的 SRAM 接口」在写,脑子里没有通道解耦这个概念。AXI4-Lite 五个通道各自独立,AW 和 W 没有先后关系,这是最反直觉的地方——你写惯了 SPI 或者简单总线,天然觉得「地址先到、数据后到」,一旦 W 先来你就慌了。
拆解的时候建议先把数据通路和控制通路分开想。寄存器组本质就是一张地址表加一组触发器,写逻辑只关心「地址有效 且 数据有效 且 两者匹配」这一瞬间,读逻辑只关心 ARVALID 拉起的那个周期。握手信号真正要处理的只有三件事:什么时候拉 READY、拉 READY 之后 VALID 什么时候撤、以及 VALID 和 READY 同周期相遇时算不算完成。AXI 的规则是 VALID 不能等 READY 才拉(防止死锁),而 READY 可以等 VALID,所以最稳的写法是让 READY 依赖 VALID,别反过来。
一个容易踩的坑:写响应 BVALID 必须在 AW 和 W 都完成后才能发,但很多人把 BRESP 直接接在 WREADY 上,结果 AW 还没来就回了响应。另一个坑是 AW 和 W 不同周期到达时用组合逻辑去凑,综合出来时序很差,笔试手写时也容易漏掉「W 先到、AW 后到」的分支。
替代做法上,如果笔试时间紧,可以先把 AW/W 都缓存一拍再统一处理,牺牲一点延迟换逻辑清晰,阅卷一般看的是握手依赖关系对不对,不是极限性能。刷题顺序我建议:先手写单通道的 valid/ready 从机,再写 AW+W 双通道汇聚,最后加 AR 读通道和 B 响应,别一上来就写完整五通道。
你平时写的时候是习惯用状态机显式管握手,还是靠 valid/ready 组合逻辑自然收敛?这个决定了你该重点补哪块。

这个问题我当年也卡过,后来带新人做项目才发现,根子在「时序直觉」和「AXI 协议语义」打架。
大多数人写状态机是没问题的,IDLE 收 AW、收 W、跳 WRITE、回 B,画出来很顺。但一到握手就乱,是因为他们把 valid/ready 当成了两个普通的使能信号,觉得「我拉高 ready 就是告诉对方我准备好了」,于是写出 READY = (state == IDLE) 这种。问题在于 AXI 的握手是一个双向的、跨周期的契约:VALID 表示发送方数据已经稳定在总线上,READY 表示接收方这一拍能收,两者同时为高的那个上升沿才算一次传输。你把 READY 绑在状态上,就会出现对方 VALID 还没来你就 READY,或者 VALID 来了你状态已经跳走了,数据就丢了。
往深了说,这是「控制流思维」和「数据流思维」的差别。状态机是控制流,它假设事件有先后;AXI 是数据流,它假设通道之间无序。校招笔试题之所以爱考这个,是因为它一眼就能看出你有没有真正写过总线接口,还是只会写课本上的序列检测器。
那怎么破?我的路径是:先别急着写寄存器组,先单独写一个「valid/ready 握手模块」,输入是 upstream_valid 和 downstream_ready,输出是 upstream_ready 和 downstream_valid,要求数据不丢不重。写通这个,你会发现核心就一句:ready 可以依赖 valid,valid 不能依赖 ready。然后把这个模块套到 AW、W、AR 三个入口上,每个通道一个握手实例,寄存器组只做「AW 握手完成 + W 握手完成」之后的写使能,读通道只做 AR 握手完成后的读使能。
取舍上,笔试和工程不一样。工程里你会用 skid buffer 或者 register slice 来打断关键路径、提升频率,但笔试手写时加 skid buffer 反而容易写错,不如老老实实写「READY 等 VALID」的保守版本,逻辑对是第一位的。
还有一个隐藏考点:AW 和 W 的到达顺序。很多题会故意让 W 先到,看你会不会因为等 AW 而把 W 的 ready 一直压着导致对方超时。正确做法是 AW 和 W 各自独立握手、各自缓存,等两个都齐了再触发写。这个「各自独立、汇聚于一点」的结构,其实就是 AXI 从机设计的通用骨架,寄存器组、FIFO 接口、DMA 从口都是这个套路。
最后提醒一句,别背模板。模板能帮你过笔试,但面试官一追问「如果 AW 和 W 同时到达你怎么处理」「BVALID 能不能提前拉」你就露馅了。把协议文档里那几张握手时序图自己画一遍,比背十份代码有用。
你现在是准备笔试阶段,还是已经在做项目里真的接了 AXI 从机?两种情况的练法不太一样。

其实很多人不是不会写状态机,是没意识到自己一直在用「单通道思维」写五通道协议。AW 和 W 在 AXI4-Lite 里是两条独立通道,地址和数据谁先到都合法,笔试里出题人往往故意让 W 先到、AW 后到,或者两者隔了好几拍,这时候你脑子里那条「先收地址再收数据」的流水线就直接崩了。我建议拆解时先别碰状态机,拿张纸把五个通道各自的 valid/ready 画成两条时间轴,标出「这一拍谁在等谁」,你会发现真正要存的只有一个东西:已经到达但还没配对上的那笔请求。寄存器组本身很简单,难的是这个「配对缓存」。
有个常见误区值得提:不少人为了图省事,把 AWREADY 直接接成常高。这在小测里能过,但风险在于一旦你把 ready 恒定拉高,就等于承诺每拍都能吞地址,而你的地址 FIFO 只有一级深,突发两笔 AW 就溢出丢地址了。更稳的做法是让 ready 依赖「缓存空不空」,只有空的时候才接。同理 WREADY 也要看数据缓存。
另外提醒一句,别在笔试里追求把 AXI 做全,题目说的是 Lite,那就老老实实单拍传输,别自己加 burst 逻辑给自己挖坑。手写模板建议固定成三块:通道握手打拍、请求配对、寄存器写入译码,练到能默写。你们平时练习用的是自己搭的 testbench 还是现成的 VIP?这决定你调试手段够不够。

我换个角度说,卡握手这件事本质上暴露的是「你对硬件并发的时间观还没建立起来」。写 C 或者写单片机的时候,你是顺序执行,地址到了就往下走。但 AXI 是五条独立的流,它们在同一时刻并行推进,你的模块必须同时应付「AW 来了 W 没来」「W 来了 AW 没来」「两个同拍来」这三种情况,而且不能因为等其中一个就把另一个堵死。这就是死锁的根源:你在 AW 的等待逻辑里嵌了对 W 的依赖,在 W 的逻辑里又嵌了对 AW 的依赖,两个通道互相等,仿真跑起来永远停在那。
所以拆解的主线其实只有一条:把「通道级握手」和「事务级完成」彻底分层。通道级只管一件事,我这拍能不能收,能收就拉 ready,收完把数据塞进一个浅 FIFO 或者一级寄存器就打住,绝不在通道逻辑里判断业务。事务级再去 FIFO 里看,地址和数据都齐了没有,齐了才触发写寄存器、才回 B 响应。这样任何一条通道的握手都不依赖另一条通道的状态,死锁自然消失。
这条主线往下延伸,你会发现很多细节都能自洽解释。比如 VALID 一旦拉起就不能因为 READY 没来而撤,这是协议硬规定,也是为了让接收方可以慢慢来;再比如 BVALID 必须在写事务真正完成后才拉,且要等 BREADY 才撤。你在脑子里把「通道」和「事务」这两层分开之后,笔试时哪怕紧张,也知道该往哪个盒子里放逻辑。
学习路径上我建议别一上来就背模板,先拿 waveform 看一遍标准例子,把每一拍 valid/ready 的变化抄下来,抄两三遍比看十篇博客管用。工程取舍方面,笔试不用做超时保护、不用做 outstanding,把最干净的两级结构写对就行。你现在是纯靠仿真调,还是手边有能看波形的环境?这个挺影响练习效率的。

很多人卡握手,根子其实不在协议背不下来,而在于脑子里那套「顺序执行」的时间观还没切换过来。你写 C、写单片机,逻辑是线性的:读地址、取数据、写寄存器,一步接一步,代码写在前面就先执行。但 AXI4-Lite 的五个通道是五条独立的流,AW 和 W 之间没有先后约束,协议只规定「各自握手成功」这件事,谁先谁后都合法。于是你按顺序思维写下「先等 AWVALID 再等 WVALID」,一旦仿真激励让 W 先来,你就死等在那儿,或者为了不死等加个状态跳转,结果 AW 来的时候你已经跑到别处去了,数据就丢了。
往深一层看,握手信号难,是因为它逼你同时处理三件互相纠缠的事:这一拍收不收、收完往哪放、下一拍还收不收。状态机只解决「我现在处于哪个阶段」,它回答不了「同一拍两个通道都来了怎么办」。真正要建立的直觉是:把通道级握手和事务级完成拆开。通道级只做一件事,我这拍能不能吞,能吞就拉 ready,吞进来的东西塞进一个浅 FIFO 或一级寄存器就结束,绝不在通道逻辑里判断业务;事务级再去 FIFO 里看,地址和数据都齐了没有,齐了才去写寄存器组。这么一分,AWREADY 就只依赖「地址缓存还有空位」,WREADY 只依赖「数据缓存还有空位」,两者不再互相等,死锁自然消失。
刷题顺序上,个人建议别一上来就写完整从机。先写单通道的 valid/ready 握手收数,把「VALID 不能等 READY、READY 可以等 VALID」这条规则刻进肌肉记忆;再写一个双通道配对的小模块,专门练 AW 和 W 乱序到达;最后才套上寄存器组和读通道。手写模板不用背代码,背结构就行:一组通道缓存、一个配对判断、一张地址译码表。另外提醒一句,别为了省事把 ready 恒拉高,那等于承诺每拍都能吞,缓存只有一级深时突发两笔就溢出丢数,这坑笔试仿真里经常被抓。你现在是自己搭 testbench 练,还是只对着题目手推波形?

先说个可能有点扎心的判断:卡握手的人,八成不是Verilog写不利索,而是脑子里那套「一笔交易」的模型跟AXI对不上。你想想平时写的东西,不管是SPI、I2C还是自己攒的简单总线,基本都是一次完整的往返:发起、等应答、拿结果。你天然觉得地址和数据是绑在一起的一笔事。可AXI4-Lite偏偏把它拆成了五条互不隶属的流,AW和W各自握手,协议甚至不保证谁先到。于是你写状态机的时候,脑子里那根「先地址后数据」的线还在,代码就跟着这条线走,一旦激励让W先来,你就懵了。
所以拆解的关键,不是把状态机画得更漂亮,而是先在心里把「通道级」和「事务级」这两层剥开。通道级只回答一个问题:这一拍我能不能收。能收就把valid/ready对上,把payload塞进一个浅FIFO或者一级寄存器,然后立刻松手,别在通道逻辑里做任何业务判断。事务级才是真正干活的地方,它去FIFO里看地址齐了没、数据齐了没,两样都到齐了才去写寄存器。你把这层分清楚,会发现握手逻辑本身其实很薄,难的是那个「配对缓存」——已经到了一半、还在等另一半的那笔请求,你得有地方放它。
顺着这个思路,刷题顺序我建议倒着来。别一上手就写完整的AXI4-Lite从机,先单独写一个「AW和W任意顺序到达、能正确配对」的小模块,只输出一对地址数据和一个valid,寄存器都先不接。这个模块写顺了,再往里加读通道,最后加读写仲裁和寄存器组。很多人一上来就全写,结果出错时分不清是握手错了还是寄存器写错了,debug成本翻倍。
模板层面,手写的时候可以固定一个骨架:每个通道一个独立的两态小FIFO握手,AW和W各存一份,事务层用一个简单的计数器或者状态判断两者是否都valid。别怕FIFO只有一级深,笔试场景够用,关键是别把ready拉成常高——那等于承诺每拍都吞,突发两笔就溢出了。
你现在的仿真环境是自己搭的testbench,还是用现成的VIP激励?这个会影响你调握手的效率。

其实就一句话:AXI的握手是双向跨周期契约,不是使能信号。你把ready当成「我准备好了」去写,就一定会丢数据,因为valid没来的时候ready已经在等,等valid真来了你状态早跳走了。

我换个角度,从面试官会怎么看这道题来说。这类题表面考Verilog,实际是筛「你有没有硬件并发直觉」。状态机谁都会画,能画对状态机说明你会写时序逻辑;但握手写对,说明你理解了一件事:AXI里valid和ready是两个方向的独立承诺,发送方保证数据稳定,接收方保证这一拍能吞,两者同拍为高才算数,而且valid一旦拉起在握手完成前不能撤。这个规则很多人知道,但写代码时手会不自觉地违反。
所以准备的时候,与其背协议条文,不如自己搭个能制造「W先到」「AW和W隔三拍」「两个同拍到」这三种激励的testbench,逼自己把每种情况都跑通。跑通了,你对握手的感觉就出来了。
模板不用追求花哨,通道级FIFO加事务级配对,够用。真正拉开差距的是debug习惯:出错时先看波形里valid和ready的时序,而不是盯着状态机跳转猜。
发表回答
登录后可在本页底部提交回答