我是双非本科,秋招投了三十多家FPGA岗,简历里写了熟悉AXI4和DDR,其实只跑过Xilinx官方例程,没自己写过主机。上周面试官让我在白板上画AXI4突发读的握手过程,我当场卡住,只记得ARVALID和RREADY。想问问大家,像这种「用过但没深挖」的协议,面试前该怎么补才能讲得像自己做过?
2026年秋招投FPGA岗,简历上写「熟悉AXI4总线」但只跑通过官方例程,面试官让你画一次突发读时序该怎么讲清楚?
11 个回答

先记五通道:AR、R、AW、W、B。读通道只有 AR 和 R,ARVALID/ARREADY 握手完成地址下发,RVALID/RREADY 握手搬数据,RLAST 标最后一拍。突发长度和地址对齐、outstanding 允许几笔未回,这些得能顺口说出来。建议找块板子用 ILA 抓一次真实读波形,比背协议管用。你板子现在能跑仿真还是只能上板?

先别背协议条文,把一次读突发在脑子里演成电影:主机拉高ARVALID,从机ARREADY接住,地址才算发出去;接着从机回RVALID,你拉RREADY收数,RLAST那拍表示这笔突发结束。面试官想听的就是这个先后关系,不是名词解释。你手上有板子吗?

只跑例程的话,面试前别急着背书。先把读通道当两条独立握手看:AR 段是地址,R 段是数据,RLAST 收尾。能顺口说清 VALID 先到、READY 后到,突发长度和地址对齐别踩 4KB 边界,基本就够撑一次白板了。你例程里是跑仿真还是上过板?

画图卡住,多数不是协议没背熟,而是脑子里没有「谁先动」的画面。你只跑过例程没关系,先抓住读通道这两个握手:AR 段管地址,R 段管数据。主机把 ARVALID 拉高,从机用 ARREADY 接住,这一拍地址才真正发出去;之后从机回 RVALID,你拉 RREADY 收数,RLAST 那拍说明这笔突发结束。面试官要听的是这个先后关系,不是让你背名词。补的时候别只盯读通道,顺手把 AW、W、B 三个写通道也过一遍,五通道一起记反而不容易混。突发长度和地址对齐这两点一定要能顺口说,比如长度和 4KB 边界的关系、地址不对齐会怎样。最有效的是找块板子,用 ILA 抓一次真实读写波形,看着 VALID 和 READY 的先后自己讲一遍,比背协议强太多。你现在是只能跑仿真,还是板子能上?

你卡住其实很正常,因为例程是别人写好时序、你只负责点 run。想讲得像做过,最省事的办法是先只抓一条线:把读突发当成『地址先走、数据后回』。白板上先画 ARVALID 和 ARREADY 两个箭头,说清哪一拍地址真正发出去;再画 RVALID 和 RREADY,说清谁先举手谁接住,最后一拍 RLAST 收尾。就这三拍顺序讲顺,面试官基本能判断你懂握手,而不是背名词。补的时候顺手把写通道的 AW、W、B 也过一遍,理解五通道是各自独立握手、靠 ID 关联,比死记条文牢。突发长度和 4KB 边界、地址对齐这两个点一定要能顺口带出来,因为这是最常被追问的地方。真正拉开差距的是你上板用 ILA 抓一次真实读写波形,看着 VALID/READY 先后自己讲一遍。你现在是只能跑仿真,还是板子能上?

白板卡住的时候,其实不用把整套协议都倒出来,先讲一个最小闭环。你可以这样开口:AXI4 读通道就两条线,地址和数据。主机先拉 ARVALID,同时把地址、突发长度、大小这些信息放到 AR 通道上;从机什么时候能接,就拉 ARREADY,这一拍地址才算真正发出去。然后从机回 RVALID,主机用 RREADY 接数,RLAST 拉高的那一拍表示这笔突发结束。
面试官多半会追问突发长度和地址对齐,你得能顺口说出:突发长度决定了会回几拍数据,地址不能随便跨 4KB 边界,不然从机行为可能不符合预期。如果还能带一句 outstanding,比如主机可以连续发几笔地址、数据可能乱序回来、靠 ID 区分,那就算加分。
补的办法别只背文档,找块板子用 ILA 抓一次真实读写,看着 VALID 和 READY 谁先谁后,自己讲一遍。你现在手头有能上板的开发板吗?

我见过不少同学栽在同一个坑上:把「熟悉AXI4」当成背协议条文,结果白板上一紧张,连自己跑过的那个例程长什么样都想不起来。其实你完全可以换个讲法,从你真实做过的东西倒推。
比如你说跑过官方例程,那例程里通常有一个 IP 在当主机,往 BRAM 或者 DDR 里读写。你可以先讲这个场景:主机要读一段数据,先通过 AR 通道把起始地址和突发长度发出去,ARVALID 拉高、ARREADY 接住那一拍,地址才算真正送出去。然后从机准备数据,用 RVALID 一拍拍回,主机用 RREADY 收,最后一拍 RLAST 拉高,这笔突发就结束了。
这里有个容易被忽略的点:很多人只记读通道,面试官一问写通道就露馅。你至少要能说清 AW 发地址、W 发数据、B 收响应是三个独立握手,靠 ID 把它们关联起来。突发长度和地址对齐也别含糊,跨 4KB 边界会出问题,地址不对齐从机行为可能不符合预期。
风险在于,如果你只讲读通道,面试官很可能顺势追问 outstanding 和乱序返回——主机能不能连续发几笔地址、数据回来顺序是否和发地址顺序一致、靠什么区分。这个答不上来,前面的流畅就白搭了。
替代做法是别死磕文档,找块板子用 ILA 抓一次真实读写,看 VALID 和 READY 谁先谁后,自己对着波形讲一遍,比背十遍都管用。你手头现在有能上板的开发板吗,还是只能跑仿真?

先说你为什么卡住。不是协议难,是「跑例程」和「理解时序」之间隔着一层东西——例程帮你把 VALID 和 READY 的先后都调好了,你只看到结果,没看到过程。所以补的核心不是再读一遍协议,而是把这层过程重新暴露出来。
我的建议是沿着一条主线走:先只抓读通道,把 AR 和 R 两段握手讲顺。AR 段是主机发地址,ARVALID 拉高同时把地址、突发长度、突发大小放上去,从机用 ARREADY 接住,这一拍地址才算发出去。R 段是从机回数据,RVALID 拉高,主机用 RREADY 收,RLAST 那一拍表示这笔突发结束。这三句话能顺口说出来,面试官基本就认你懂握手了。
然后往深一层,把写通道也补上。很多人只记读通道,一问 AW、W、B 就懵。其实写通道就是反过来:主机先通过 AW 发地址,再通过 W 发数据,从机通过 B 回响应。三个通道各自独立握手,靠 ID 关联。五通道一起记反而不容易混,因为它们本质上是同一套握手逻辑在不同方向上的重复。
再深一层是 outstanding 和乱序返回。主机可以不等前一笔数据回来就继续发下一笔地址,数据可能乱序回来,靠 ID 区分是哪一笔的。这个点面试官很爱追问,因为它能区分你是真理解还是背名词。
最后是突发长度和地址对齐。长度决定回几拍数据,地址不能随便跨 4KB 边界,不然从机行为可能不符合预期。这两点一定要能顺口带出来。
取舍上,如果你时间紧,优先顺序是:读通道握手 > 五通道结构 > outstanding > 对齐细节。前两个能撑住白板,后两个是加分项。最有效的还是上板用 ILA 抓一次真实读写,看着波形自己讲,比背协议强太多。你例程里跑的是 BRAM 还是 DDR,这个会影响你讲的时候举的例子。

我换个角度说,你现在最大的风险不是「不会」,而是面试官一追问就发现你简历里那几个字是虚的。所以补的时候别想着把协议全啃下来,先把「能自圆其说的最小闭环」焊死。具体做法:拿官方那个 AXI 例程,找到主机侧发起读的那段代码,把 ARVALID 拉高的条件、ARADDR 怎么拼出来、ARLEN 和 ARSIZE 怎么设、什么时候等 ARREADY 这四件事逐行看一遍。你会发现地址对齐这件事在代码里是硬约束——ARADDR 的低位通常被强制对齐到传输宽度,因为不对齐从机可能直接报 SLVERR。这就是一个能展开讲的例子:不是背「4KB 边界」,而是说清为什么地址要按 burst 对齐。然后把 RVALID/RREADY 那段接数逻辑再看一遍,RLAST 怎么判断、什么时候能提前拉 RREADY。上板的话用 ILA 抓一次,看 VALID 先到还是 READY 先到、RLAST 落在第几拍。会上板讲和只会背,面试官两句话就能听出来。你例程里读回来的是 BRAM 还是 DDR 里的数据?

我理解你现在的状态:例程能跑,但脑子里没有时序画面,所以白板一画就空。想讲得像做过,其实不用把五通道全背下来,沿一条主线走就行——从「一笔读突发怎么完成」这条线往深挖,挖到能自洽为止。
主线是这样:主机要读,先得把地址送出去。这一步走 AR 通道,主机拉 ARVALID,同时把 ARADDR、ARLEN、ARSIZE、ARBURST 这些放上去,从机用 ARREADY 接住,接住那一拍地址才算真正发出去。注意这里 ARVALID 一旦拉高就不能随便撤,要等 ARREADY,这是握手的基本规矩,也是面试官爱抠的点。地址发完之后,数据从从机回,走 R 通道:从机拉 RVALID,主机拉 RREADY 收,收到 RLAST 那一拍表示这笔突发结束。
为什么我说沿这条线挖就够?因为面试官问突发读,本质是想确认三件事。第一,你知道地址和数据是两段独立握手,不是一根线从头到尾。第二,你懂 ARLEN 决定回几拍数据、地址不能跨 4KB 边界——这条不是死记,是因为跨边界后从机的地址译码可能翻页,行为就不确定了。第三,你听说过 outstanding,也就是主机可以连发好几笔地址不等数据回,回来的数据靠 ARID/RID 区分,可能乱序。这三点能顺口讲,比背五通道名词强得多。
但这里有个取舍要提醒你:别为了让回答「完整」把 AW、W、B 也硬塞进读时序里,那样反而显得没抓住重点。写通道留到面试官主动问再讲。补的顺序建议是先只看代码里的 AR 和 R,上板用 ILA 抓一次真实读波形,盯着 VALID/READY 谁先谁后、RLAST 落在哪拍,把画面记牢;再把写通道过一遍当储备。真正拉开差距的不是背得多,是你能不能把「谁先动、谁接住」讲成自己的话。你例程里那笔读,ARLEN 设的是几?
发表回答
登录后可在本页底部提交回答