2026年FPGA校招笔试出现「用Verilog实现AXI4-Lite从机寄存器读写」,没写过总线协议的应届生两周内怎么突击?

开放12 回答 87 浏览

最近做某芯片公司的FPGA笔试题,最后一道大题要求手写AXI4-Lite从机,包含地址译码、读写通道握手和寄存器映射。我平时只写过UART和SPI,对valid/ready机制完全没概念。想请教有笔试经验的同学,这种总线类手撕题有没有固定的答题模板?两周时间应该先看协议哪几章、练哪几个典型题?

分享:

12 个回答

  • 电路设计小白

    两周突击总线题,先别急着背模板,得先想清楚一件事:笔试要的是『能综合、能跑通握手』,不是让你把AXI全协议啃完。AXI4-Lite就五组通道,考从机的话真正要写的只有写地址、写数据、写响应、读地址、读数据这几路的valid/ready配对逻辑,其余章节可以先放。

    最小路径我建议这样排:第一天只搞懂valid/ready的握手语义——valid由发送方拉高后必须等ready才能撤,ready可以等valid来之前就先拉高,这个『谁等谁』的关系想明白,后面全是套路。第二天照着协议图把五个通道的时序画一遍,重点看写通道里aw和w谁先到都允许、读通道里ar到r的延迟。第三天到第五天开始手写,先写一个最简版:地址译码用case,寄存器用always块,握手信号用状态机或者直接组合判断。写到能仿真出波形为止,比看十遍协议有用。

    风险在于很多人卡在『写响应什么时候发』——bvalid必须等aw和w都握手完成、且寄存器写完才能拉高,这个顺序错了仿真就挂。替代做法是先用一个简单的寄存器堆练手,把地址映射和读写仲裁写熟,再套AXI外壳。典型练习就三个:单寄存器读写、多寄存器地址译码、带写响应的完整从机。仿真工具用Vivado自带的就行,别折腾环境。

    你手头有能跑仿真的环境吗?如果有,先跑通一个最小从机比什么都强。

    另外别忽略笔试的隐藏分:注释和模块划分会加分。把通道拆成独立always块,命名规范点,即使逻辑没全对,阅卷老师也能看出你懂结构。两周够用了,前提是别陷进协议细节里出不来。

  • EE学生一枚

    这个问题其实暴露了一个更本质的困境:你平时写的UART、SPI是『没有握手概念』的协议,数据来了就收,时序靠波特率或时钟约定。而AXI4-Lite的核心恰恰是把『双方什么时候都准备好了』这件事显式化,valid/ready就是干这个的。所以突击的重点不是背AXI的章节,而是先把『握手』这个思维模型装进脑子里。

    我建议你按一条主线走:从『一个信号什么时候能撤』推导出所有逻辑。valid拉高后,发送方不能自己撤,必须等到ready为高才算一次传输完成;ready可以提前拉高,表示接收方一直有空。把这句话吃透,写通道的awvalid/awready、wvalid/wready、bvalid/bready就都是同一个模式的不同实例。读通道的ar和r同理,只是方向反过来。你会发现协议里那些图,本质都在画这个『等对方』的关系。

    接下来是取舍。AXI4-Lite从机可以写成纯组合逻辑加寄存器,也可以用状态机。笔试手写的话,状态机更稳,因为阅卷老师一眼能看出你懂流程。但状态机别写太复杂,写通道三个状态(等地址、等数据、发响应)足够,读通道两个状态(等地址、回数据)。地址译码用case语句直接映射到寄存器数组,别搞什么动态译码,笔试不考这个。

    常见的误区有三个。一是把aw和w当成必须同时到达,其实协议允许它们任意顺序,你写逻辑时要么用两个独立握手信号再汇合,要么用状态机分别等。二是bvalid拉高的时机,必须等aw和w都完成握手、且寄存器写入动作做完,很多人提前拉导致仿真波形错乱。三是读数据rvalid的延迟,从机可以在ar握手后下一拍就给,也可以等几拍,但一旦拉高必须保持到rready。

    两周的节奏我建议前三天只做一件事:拿纸画时序图,把五种通道的握手波形各画一遍,画到不用看协议就能默写。中间五天写代码,先写单寄存器版本,仿真通过后加地址译码,再加写响应。最后两三天找几道类似的笔试题练手,重点练『给一个寄存器映射表,你能不能在二十分钟内写出框架』。

    其实这类题考的不是你多懂AXI,而是你能不能把『握手』这个抽象概念落地成可综合的RTL。你如果能把valid/ready的关系讲清楚,代码结构合理,即使有小bug,笔试也能拿到大部分分。你现在手头有Vivado或者别的仿真环境吗?有的话今晚就可以开始画波形了。

  • Byte新手

    先给你一个能落地的判断:笔试里这类题,阅卷人真正在找的不是你背没背过AXI手册,而是你懂不懂『一次传输什么时候算结束』。抓住这点,两周完全够用。

    第一周别贪多。协议里优先看valid/ready握手的语义、写地址/写数据/写响应/读地址/读数据这五组通道的时序关系,其它章节(burst、outstanding、cache属性)先跳过,AXI4-Lite本来就不涉及突发。你要反复确认两个规则:valid拉高后发送方不能自己撤,必须等ready;ready可以提前拉高。把这两句变成条件反射,剩下的通道都是同一个模式的复制。

    第二周动手。我建议你先写一个最简从机骨架:用case做地址译码,映射到几个寄存器,写通道用状态机处理aw和w谁先到的问题,读通道直接组合返回。先跑通波形,再考虑加超时、错误响应这类加分项。这里有个常见风险:很多人把aw和w当成一定同时到达,结果仿真一跑就挂——协议允许两者任意顺序,用状态机分别记录各自是否到齐,是最稳的写法。

    替代做法也有:如果时间实在不够,至少把写通道的状态机写对,读通道用最简单的always组合逻辑实现,也能拿到大部分分。练手题可以自己造:一个带四个寄存器的从机,先仿真写后读,再仿真aw和w乱序到达。你现在的仿真环境用的是哪套,Vivado还是别的?这会决定你波形调试的节奏。

  • 逻辑小白

    如果你只有两周,我建议把这件事当成一次『思维模型迁移』来练,而不是当知识点去背。你写过UART和SPI,说明你脑子里已经有一套『数据来了就收』的直觉,但总线协议考的是另一件事:双方怎么确认彼此都准备好了。AXI4-Lite把这件事显式化成valid/ready,一旦你接受了这个前提,后面所有通道的逻辑其实是同一条规则的反复应用。

    我当年第一次看AXI也是懵的,后来发现卡点不在协议本身,而在没有一个可以对照的『最小正确实现』。所以主线应该是这样:先花两三天只做一件事——把valid/ready的时序关系画成手绘图,自己标注『什么时候能拉高、什么时候能撤、谁等谁』。这一步慢一点没关系,因为它是后面所有代码的地基。地基没打牢,你写出来的状态机一定会在aw和w的到达顺序上翻车。

    接下来进入实现。地址译码用case最省事,寄存器用always块,难点在写通道:awvalid和wvalid可能不同时到,所以你需要分别记录『地址到了没』『数据到了没』,两者都齐了才写寄存器并回bvalid。读通道相对简单,arvalid来了之后把对应寄存器值放到rdata、拉高rvalid即可。这里有个取舍:用状态机写更规范但代码长,用组合判断更短但容易出竞争,笔试时间紧的话我倾向状态机,因为阅卷人一眼能看出你懂握手。

    再往深一层,为什么协议要允许aw和w乱序?因为真实系统里地址和数据可能来自不同路径,强制同步会降低效率。理解了这个动机,你写状态机时就不会觉得『为什么要多此一举』,而是知道这是在为通用性买单。这种『知道为什么』的代码,在面试追问时往往比能跑通更值钱。

    最后提醒一个误区:有人为了省事把ready直接接常数1,仿真确实能过,但一旦被追问『如果从机暂时忙怎么办』就答不上来。至少留一个可以拉低ready的分支,哪怕只是注释说明。你目前是打算纯手写还是用现成IP对照着看?这两条路复习节奏差别挺大的。

  • FPGA小学生

    先说个容易被忽略的点:笔试手撕总线从机,改卷人一般不会逐行抠你的协议细节,他们看的是你有没有把「握手」这件事的因果关系理顺。所以两周的主线不该是「把AXI4-Lite协议读完」,而是「用一套统一的规则把五组通道串起来」。你写过UART和SPI,脑子里其实已经有数据流的概念,缺的只是『谁等谁』这层显式约定。

    这条主线可以这样理解:valid是发送方说「我有货」,ready是接收方说「我接得住」,一次传输完成的充要条件就是两者同时为高。由此可以推出两条铁律——valid拉高后不能自己撤,必须等ready;ready可以提前拉高,表示一直有空。把这两句话当成公理,后面所有通道都不是新知识,而是这条公理在不同方向上的实例:写地址、写数据、写响应是主机发从机收,读地址、读数据是从机发主机收,方向变了,谁负责valid谁负责ready跟着换而已。

    为什么很多人卡在写通道?因为aw和w是两条独立的通道,谁先到都合法,你不能假设aw一定先来,也不能假设w一定先来。这就是状态机存在的意义——用一个idle/写地址/写数据/写响应的状态流转,把「等另一条到齐再干活」这件事显式表达出来。读通道反而简单,因为ar和r基本是顺序关系,组合返回或者打一拍都行。

    时间分配上,我会把两周切成前四天理清语义、后十天动手。前四天不写代码,只画时序图:手绘awvalid/awready和wvalid/wready可能出现的先后组合,标出每个时刻哪些信号该高。这一步慢,但它决定你后面写的状态机会不会在顺序上翻车。后十天从最小从机骨架开始:地址译码用case映射到几个寄存器,写通道用状态机处理aw/w到达顺序,读通道先做最简返回。跑通波形再加错误响应、超时这类加分项。

    提醒一句,别一上来就啃burst、outstanding、cache这些章节,AXI4-Lite本来就不涉及突发,看了也白看。练题就练一个:从机寄存器读写,把它写熟比刷十道不同类型的题有用。你现在手头有仿真环境吗,还是只能靠纸笔推时序?

  • Linux菜鸟

    先把你脑子里的UART/SPI直觉放一边,因为那套经验在AXI上会误导你。UART和SPI的本质是『数据来了我就收』,双方靠波特率或时钟相位事先约定好节奏,没有谁等谁的问题。而AXI4-Lite要考的恰恰是相反的东西:双方怎么确认彼此都准备好了。所以这两周的主线只有一条——把握手当成一种『协商』来理解,而不是当成新协议来背。

    这条主线怎么往深处走?你可以从valid/ready的因果关系反推所有通道的行为。valid是发送方声明『我这边有货了』,ready是接收方声明『我这边接得住』,一次传输真正完成,只有两者同时为高的那个时钟沿。由此能推出两条铁律:valid一旦拉高,发送方不能自己撤,必须等到ready;ready可以提前拉高表示一直有空。这两句话之所以重要,是因为它决定了你状态机的写法——你不能让valid跟着内部状态乱跳,否则仿真波形里握手会永远对不上。

    接下来做一次迁移:写地址、写数据、写响应是主机发从机收,读地址、读数据是从机发主机收,方向变了,谁负责valid谁负责ready就跟着变。你会发现五组通道其实是同一条规则的五次复制,只是方向不同。协议里那些时序图,画的都是这条规则在不同通道上的展开。

    取舍上,两周里burst、outstanding、cache属性这些先跳过,AXI4-Lite本来就不涉及突发。真正要动手的是写通道里aw和w谁先到都允许这个细节——这是最容易翻车的地方,因为很多人的状态机会默认aw先到。你可以用一个小状态机专门记录aw和w各自的到达标志,两个都到齐再写寄存器、再拉bvalid。读通道相对简单,ar到了之后隔一拍返回rvalid和rdata即可。

    最后提醒一个常见误区:很多人把地址译码写得很复杂,其实用case把高几位地址映射到几个寄存器就够了,笔试卷面看的是握手逻辑,不是译码多花哨。你平时写UART时有没有用过类似valid/ready这种双向确认的机制?如果没有,第一周就专心把这一层想透。

  • 单片机初学者

    两周足够,别贪多。核心就一句:valid/ready谁等谁。把五个通道都当成这一句的重复,笔试基本能写出来。协议里burst、outstanding先跳过,Lite用不上。先动手画一遍aw和w谁先到的波形,比读十页手册管用。你打算用状态机还是组合判断来写握手?

  • 硅农预备役2024

    两周够,但别按『学完协议』的思路走。先只啃valid/ready那一节,把『valid拉高不能自己撤、ready可以提前拉高』这两句刻进脑子,后面五个通道就是同一句话换方向。写通道aw和w谁先到都要能接,这是最容易翻车的地方。你打算先手画波形还是直接上代码?

  • 电路板玩家

    先别翻手册,直接找一份现成的AXI4-Lite从机代码(比如网上常见的寄存器模块),对着波形把aw、w、ar、r四条通道的valid/ready谁等谁看清楚。手画两三遍比读十页协议快。你手头有能跑的仿真环境吗?

  • 代码小萌新

    先说结论:别把这两周花在「读完协议」上,笔试手撕AXI4-Lite从机,真正考的就一件事——你有没有把valid/ready当成一种「双方协商」的机制来理解。你写过UART和SPI,脑子里是「数据来了就收」的直觉,而AXI恰恰反过来,重点在确认彼此都准备好了。所以主线就一条:valid是发送方说我有货,ready是接收方说我接得住,一次传输完成的充要条件就是同一个时钟沿两者同时为高。由此直接推出两条铁律:valid拉高后发送方不能自己撤,必须等ready;ready可以提前拉高表示一直有空。把这两句当公理,五个通道就都是这条规则换方向的实例。写通道aw和w谁先到都要能接,这是最容易翻车的地方,建议你用状态机处理。地址译码用case最省事,映射到几个寄存器就够。协议里burst、outstanding、cache这些先跳过,Lite用不上。你现在的仿真环境是Vivado还是别的?这个会影响我推荐你怎么练波形。

登录后可在本页底部提交回答

提问者

FPGA萌新成长记查看主页
浏览「其他」

描述场景与已尝试方案,更容易获得有效解答

相关问题

同分类

提问建议

  • 标题写清核心疑问,避免「求助」「请问」等空泛用语
  • 正文补充环境、版本、报错信息或截图
  • 先搜索本站是否已有相近问题,减少重复提问
  • 若与课程相关,请标明课时或章节便于讲师定位