最近面了几家FPGA岗,简历写了熟悉AXI4,结果面试官直接让我画AR/R握手到RLAST的完整时序,还问outstanding和乱序返回怎么理解。我平时都是Vivado里直接连MIG和DMA的IP核,配置界面点一点就过了,真没深究过通道依赖和burst拆分。现在补还来得及吗?该从哪个文档或者开源工程入手,才能两周内把这套总线讲明白?
2026年FPGA校招简历上写「熟悉AXI4总线」,面试官让你画一张读突发时序图并解释outstanding能力,只会调IP核的人该怎么补?
9 个回答

先说最省事的路子:别一上来啃整本 UG1037,先自己画一遍。找张纸,把 AXI4 读通道的五个通道列出来,AR 和 R 是读的关键,AW/W/B 先放一边。AR 通道就是 master 发地址,valid 拉高后必须等 ready,握手那拍地址和 burst 信息才有效。然后 R 通道回来,RVALID 和 RREADY 每拍握手,RVLAST 拉高表示这次 burst 最后一拍。你把这张图手画三遍,基本就忘不掉了。outstanding 简单理解就是:master 不等前一笔读完,又发了下一笔 AR,硬件里用 ID 区分不同交易。乱序返回就是 slave 可以按 ID 先返回后发的。两周够用,重点是动手写个带反压的 slave 仿真,别光看文档。你现在手上有能跑仿真的环境吗?

先别慌,两周完全够把「能讲明白」这个层次补上,关键是别按文档目录顺序啃。我的建议是先建立一张自己的时序图:拿张纸横着画时间轴,AR 通道只画 ARVALID/ARREADY,地址和 burst 长度在握手那拍才有效;然后空几拍,再画 R 通道的 RVALID/RREADY,每拍握手一次传一份数据,RVLAST 拉高表示这一笔 burst 结束。画完你会发现读通道其实只有「发地址」和「收数据」两件事。outstanding 就是地址发出去还没等到数据回来时,又发下一笔 AR,硬件靠 ARID 区分。乱序返回就是 slave 按 ID 决定谁先回来。建议你直接打开 Vivado 自带的 AXI VIP 或者找个开源 AXI slave,跑一遍带反压的仿真,把 RVALID 拉低几拍看波形。你现在手头有能跑仿真的环境吗?

两周够用,但别把时间花在通读 UG1037 上,那样容易看两页就困。给你一条最省事的主线:只盯读通道,先把「一笔 burst 从生到死」画出来。横轴当拍数,AR 通道只画 ARVALID、ARREADY,记住握手那一拍地址才有效,之前之后都不算;然后隔几拍画 R 通道的 RVALID、RREADY,每握手一次收一份数据,RVLAST 拉高就表示这一笔结束。画完自己问三个问题:master 能不能不等数据就把下一笔 AR 发出去?这就是 outstanding;slave 能不能先回后发的那笔?这就是靠 ID 做的乱序返回。建议直接拿 Vivado 里的 AXI VIP 或找个开源 AXI slave,把 RVALID 人为压几拍跑仿真,看波形比看文字快十倍。你现在手头有能跑仿真的环境吗?

两周够,但别贪多。只画读通道:ARVALID/ARREADY 握手那拍地址才有效,然后 R 通道一拍一份数据,RVLAST 收尾。outstanding 就是上一笔没回来又发下一笔 AR,靠 ID 区分。拿 VIP 压几拍 RVALID 跑仿真,比看文档快。你仿真环境搭好了吗?

先说个容易踩的坑:很多人补 AXI 的方式是打开 UG1037 从第一章读起,读到信号列表就放弃了。其实面试官要的不是你背全表,而是你能不能把一笔读交易讲成一条时间线。所以我的建议是反过来做,先跑波形再回去查文档。具体点,找个开源 AXI slave,或者直接用 Vivado 的 AXI VIP,配成 slave 模式,让它随机反压。然后你自己写个简单的 master 逻辑,或者用 VIP 的 master 发一笔 INCR burst,把 ARVALID、ARREADY、RVALID、RREADY、RLAST、RID 都拉到波形里。跑一次,你会看到地址握手只占一拍,数据可能隔了好几拍才回来,中间那几拍就是延迟。这时候你再人为让 master 连发两笔 AR,看第二笔的地址是不是在第一笔数据回来之前就出去了,这就是 outstanding。再给两笔不同的 ARID,把 slave 配成可以乱序返回,你会看到 RID 先回来的是后发那笔,这就是乱序。整个过程一两个小时就能跑通,比啃文档扎实得多。风险在于:如果你只跑通一次就以为懂了,面试时被追问「如果 RREADY 一直不拉高会怎样」「WRAP burst 地址怎么算」还是会卡。所以跑完波形后,拿 UG1037 当字典,专门查你这笔交易里出现的信号和 burst 类型,把不懂的补齐。另外别忽略写通道,面试官很可能顺手问一句 B 通道什么时候返回。两周时间够你把读通道讲顺,写通道理解个大概,但前提是动手跑,不是光看。你打算用哪个仿真环境?

其实面试官让你画时序图,考的是你有没有真的在波形里见过这笔交易。所以别急着背协议,先找个能跑的 AXI slave,让 RVALID 随机压几拍,把 AR 到 RLAST 这段波形截下来,自己对着图讲一遍:地址哪拍有效、数据怎么回来、RLAST 在哪拍。讲不顺的地方就是你没懂的地方,回去查 UG1037 对应章节。outstanding 和乱序不用死记,你在波形里让 master 连发两笔不同 ID 的 AR,看 slave 先回哪笔,自然就明白了。文档当字典用,别通读。

先给你一个判断:面试官问这题,不是想听你把 UG1037 背下来,而是想知道你有没有在波形里见过这笔交易。只会点 IP 核的问题不在于「不会用」,而在于你只看到了黑盒的接口,没看到接口底下那条时间线。补的方向就一个:把黑盒拆开,自己造一遍。
最小路径是这样。第一步,别通读文档,先只抓读通道。AR 通道你只要盯 ARVALID、ARREADY、ARADDR、ARLEN、ARID 这几根;R 通道盯 RVALID、RREADY、RDATA、RLAST、RID。然后拿张纸横着画时间轴:ARVALID 和 ARREADY 同时为高的那一拍,地址才真正被采样,之前拉高都不算数;隔几拍之后 R 通道开始回来,每握手一次收一份数据,RLAST 拉高表示这笔 burst 结束。画到你能不看书默写出来,这一步就过了。
第二步是理解 outstanding。它的本质是流水:地址发出去之后,数据要过若干拍才回来,这段时间总线是空的,浪费。所以 master 不等第一笔数据回来就把第二笔 AR 发出去,让地址通道和数据通道并行工作,这就是 outstanding。硬件靠 ARID 区分不同交易,slave 可以按 ID 决定谁先返回,这就是乱序。你光看文字会觉得抽象,但只要在仿真里让 master 连发两笔不同 ID 的 AR,再看 slave 先回哪笔,瞬间就懂了。
第三步是动手。用 Vivado 自带的 AXI VIP,或者找个开源 AXI slave 挂上去,把 RVALID 人为压几拍制造反压,跑一次仿真截波形。反压这一步很关键,因为真实系统里 slave 经常来不及回数据,你只有见过 RVALID 被拉低、master 干等的波形,才算真的理解握手。
两周时间,前三天画图和读文档对应章节,中间一周搭仿真跑波形,最后几天对着波形自己讲一遍完整交易。讲不顺的地方就是你没懂的地方。你现在的仿真环境是已经能跑起来,还是需要从头搭?

两周时间其实不是用来补协议的,是用来补「你脑子里有没有那条时间线」的。你现在的状态是:IP 核帮你把 AXI 的所有细节都吃掉了,你只看到 AXI 接口的引脚,没看到引脚底下那根时间轴。面试官让你画读突发时序图,本质是在问:给你一个 ARVALID 拉高的波形,你能不能说出下一拍会发生什么、什么时候数据才回来、什么时候这笔交易算完。这个能力 IP 核永远教不了你,因为它把不确定性都替你处理掉了。
所以主线只有一条:把黑盒拆开,自己造一遍。先只抓读通道,AR 和 R 两条。AR 通道你只需要盯 ARVALID、ARREADY、ARADDR、ARLEN、ARID 这几根;R 通道盯 RVALID、RREADY、RDATA、RLAST、RID。拿张纸横着画时间轴,写清楚:ARVALID 和 ARREADY 同时为高的那一拍,地址才真正被采样,之前拉高都不算;隔几拍之后 R 通道开始回来,每握手一次收一份数据,RLAST 拉高表示这笔 burst 结束。画到能默写出来,第一步就过了。
第二步是理解 outstanding。这个概念光看定义没用,你要在波形里看到它:让 master 不等第一笔数据回来,就发第二笔 AR,两笔的 ARID 不同,你看 slave 先回哪一笔。这时候你会发现,ID 就是用来区分不同交易的标签,slave 可以按自己的节奏决定谁先返回,这就是乱序。outstanding 能力的本质是:地址通道和数据通道是解耦的,master 可以连续发多笔地址,硬件靠 ID 把它们分开。这个理解一旦建立,后面 WRAP、INCR、FIXED 的区别、4KB 边界、写通道的 WLAST 和 B 响应,都能顺着同一条线推出来。
工具上,UG1037 当字典查,别通读。真正省时间的是 Vivado 自带的 AXI VIP,配成 slave 模式,人为把 RVALID 压几拍,然后你自己写个简单 master 发一笔 INCR burst,把波形拉出来看。或者找个开源 AXI interconnect 工程,看它内部怎么仲裁、怎么拆 burst。跑一次仿真,比你读十页文档管用。
最后提醒一句:面试时别只画图,要边画边讲「这一拍地址有效,这几拍是延迟,这里 RLAST 收尾,这里第二笔 AR 已经出去了所以是 outstanding」。你讲得顺,面试官就知道你是真见过波形的人。你现在手头有能跑仿真的环境吗?没有的话先把 VIP 跑起来,这比继续看文档重要。

别通读 UG1037,直接开 Vivado 的 AXI VIP,配成 slave 让它随机反压,自己发两笔不同 ID 的读,把波形截下来对着讲一遍。讲不顺的地方就是你没懂的,回去查那一节。两周够,关键是动手跑仿真,不是背信号表。
发表回答
登录后可在本页底部提交回答