最近在刷2026年秋招的数字IC前端笔试题,发现很多公司都考用Verilog实现一个支持AXI4-Stream接口的DMA控制器。我看了一些面经,但感觉对描述符链表管理和地址跳变(burst地址生成)这部分理解不够深入。请问如何从状态机设计和带宽利用率角度系统准备这类题目?有没有推荐的练习项目或开源代码可以参照?
2026年秋招,数字IC前端笔试题常考用Verilog实现一个支持AXI4-Stream的DMA控制器,如何从描述符管理和地址跳变角度系统准备?
17 个回答

我来从状态机和带宽利用角度给你拆解。首先,DMA控制器的核心是状态机,通常分四阶段:描述符获取、数据搬运、中断上报、描述符回写。笔试中常考的就是你能否把AXI4-Stream的ready/valid握手信号和这个状态机结合起来。
描述符管理这块建议你画个链表结构图:每个描述符存src_addr、dst_addr、burst_len和next_ptr。状态机在IDLE态时先去读第一个描述符,拿到这些参数后进入BURST态,此时根据AXI4-Stream的tlast信号判断一个burst是否结束。地址跳变的关键是burst结束后自动把当前地址加上burst_lendata_width,再根据next_ptr抓下一个描述符。很多笔试题会在这里设坑,比如问你如果burst_len不是对齐的怎么办,这时你要在地址生成逻辑里补足对齐逻辑。
带宽利用率方面,面试官很看重你能不能做到背靠背传输。一个常见优化是描述符预取,即当前burst快结束时提前读下一个描述符,减少状态机空转。写代码时建议把AXI slave配置接口和master传输接口分开,描述符的读取单独用一个小FSM并行处理。练习项目可以去GitHub搜“simple_axidma”或“verilog_dma”,很多开源的代码结构都很清晰,适合临考刷手。

我是去年秋招上岸的,这道题我面了三次都被问到。我的经验是:别光背代码,得理解地址跳变的本质。笔试题里经常让你画波形,比如AXI4-Stream的tvalid/tready握手时地址怎么变。我当时的做法是,把描述符看成一个个原子操作:每个描述符包含一个源地址、目的地址和传输长度,DMA就是不停地处理这些原子。
地址跳变的核心是BURST地址生成器。你要写一个模块,输入是当前地址和burst长度,输出是下一地址。笔试常见陷阱是:如果描述符的length超过了AXI最大burst长度(比如16 beats),你得自动切分。我建议你状态机里加个内部计数器,记录当前burst还剩多少,burst完成后地址加axsizeburst_len。描述符链表管理更简单,每个描述符的next_ptr指向下一个,最后一个置0表示链尾。
系统准备的话,推荐你刷Xilinx的AXI DMA文档,看它的中断和延迟机制。练习题可以在牛客网搜“DMA控制器设计”,有模拟的笔试题。开源代码我推荐看“pulp-platform/axi_dma”,它的状态机划分很清晰,代码风格也适合笔试。

从面试官角度给你点建议。这类题考的无非三点:描述符链表的指针管理、地址跳变时的对齐与跨页处理、AXI握手信号的正确性。
描述符管理上,建议你用双缓冲机制:一组描述符正在传输,另一组被CPU更新,这样避免了锁问题。面试时如果你能答出用valid/ready实现描述符请求的流水线,就是加分项。地址跳变部分,我见过不少同学栽在跨4K边界上,AXI协议要求burst不能跨4KB,所以地址生成器要加个边界检测,超了就把burst拆短。状态机设计上,建议画三个并行状态机:一个管描述符读取,一个管数据通道,一个管中断上报,这样带宽利用率高。
练习推荐用“tinyDMA”项目,代码量小但覆盖了核心逻辑。笔试前可以自己用Python模拟一遍地址跳变算法,手写一遍Verilog的状态机,确保能徒手写出核心模块。最后注意:秋招笔试题常让你补全代码片段,比如描述符解析或地址计算部分,所以重点练那几个关键always块。

兄弟,你这问题问到点子上了。秋招笔试题里DMA控制器几乎是必考的,尤其是AXI4-Stream接口的,因为实际工程里用得太多。描述符管理和地址跳变这两个点,我当初准备的时候也卡了很久。先说描述符链表,本质上就是一个指向下一个描述符的指针链,硬件里用状态机来遍历。核心是设计三个状态:IDLE(等待触发)、FETCH(从内存拉描述符)、RUN(执行数据传输)。FETCH阶段要算好地址,因为描述符本身存在内存里,你得先读出来解析。地址跳变这块,关键是理解AXI burst的地址对齐和长度限制,比如burst不能跨4KB边界,实际写代码时要根据传输长度自动计算下一个burst的起始地址。我建议你去GitHub搜一个叫“axi-dma”的开源项目,Xilinx的官方版本有简化实现,对照着写一个简化版的状态机,把描述符的循环链表和地址生成逻辑搞透。另外注意,笔试里常考多通道DMA,也就是多个描述符链表并行,这时候仲裁逻辑和带宽分配才是拉分项。

我来说说实战角度吧。描述符管理其实核心就两个寄存器:当前描述符地址寄存器和下一个描述符地址寄存器。状态机可以简化为四步:1) 从当前地址读取描述符到内部寄存器;2) 解析描述符里的源地址、目的地址、传输长度;3) 发起AXI4-Stream传输,同时根据burst长度更新地址(地址跳变其实就是加法器加burst大小,但要考虑对齐);4) 传输完成后检查描述符里的NEXT指针,如果非空就跳回第一步。地址跳变容易踩坑的是,AXI4-Stream的地址生成要跟数据流对齐,比如你传的是16字节对齐的数据,地址每次加16,但描述符里给的起始地址可能是非对齐的,这时候需要额外的对齐逻辑。练习项目我推荐tinyDMA——一个开源的小型DMA控制器,代码只有几百行,非常适合笔试准备。自己用Verilog写一遍,重点把描述符的“环形链表”和“地址自动递增”逻辑写清楚。面试官一般会接着问带宽利用率,你要知道DMA的瓶颈通常在总线仲裁和描述符预取上,所以可以考虑描述符预取缓存(prefetch buffer),提前拉下一个描述符来隐藏内存访问延迟。这点答出来,面试官会觉得你有系统级思维。

从面试官的角度给你提个醒。描述符链表管理,光会写状态机是不够的,要能从系统层面讲清楚。比如,为什么用链表而不是固定描述符表?因为链表支持动态配置和任意长度传输,而固定表在流式场景下效率低。你实现的时候,状态机要处理异常情况:描述符地址非法怎么办?传输中途中断怎么办?这些笔试题里虽然不要求完整实现,但能写出异常处理状态(比如ABORT或ERROR)会加分很多。地址跳变方面,除了burst对齐,还要考虑写回描述符时的地址更新——通常传输完成后要把当前地址和剩余字节数写回描述符内存,支持断点续传。这个逻辑在面试中经常被问到。推荐参考开源项目:lowRISC的DMA控制器,它的地址生成逻辑写得比较清晰,支持scatter-gather,跟AXI4-Stream配合很好。你自己练习时,可以先实现一个单通道简化版,然后扩展成多通道,重点比较不同调度策略(轮询还是优先级)对带宽的影响。最后说一句,笔试代码里一定要加注释,状态机的跳转条件写清楚,面试官看的就是你逻辑是否严谨。

我是去年校招上岸的,这部分确实高频。先说痛点:很多同学能写出简单的DMA搬运逻辑,但一到描述符链表管理和地址跳变就卡壳,尤其是面试官追问“burst地址怎么对齐”“链式描述符如何避免死锁”时容易露馅。系统准备建议分三步:第一,把AMBA AXI4-Stream协议吃透,重点理解tready/tvalid握手和包边界(tlast)信号,手画握手时序图。第二,描述符管理上,用双缓冲或链式结构,状态机最少要包括IDLE、FETCH_DESC、EXECUTE、UPDATE_DESC四个状态,注意描述符内存里要包含源地址、目的地址、长度和下一个描述符指针。第三,地址跳变核心是burst地址对齐——如果源地址不是burst size的整数倍,要拆成非对齐头burst+中间对齐burst+尾burst,写一个地址计算模块根据剩余长度动态生成地址和burst长度。练习项目推荐看Xilinx的AXI DMA参考设计(UG021文档里有时序图),或者搜opencores上的AXI DMA开源代码,对着波形理解描述符更新和中断生成逻辑。面试时能画出状态转换图并且解释清楚如何保障带宽(比如用预取描述符隐藏延迟)就很加分了。

作为一个在面试中被虐过的人,给你个实在的建议:别光看理论,自己动手写一个简化版。痛点在于很多人把描述符管理想复杂了,其实秋招笔试通常只考单链或环形链表,不会让你实现完整的虚拟地址转物理地址。我的准备方法:先写一个只支持单次传输的DMA,包含AXI4-Stream master接口,然后逐步加入描述符链表。描述符结构体里至少要有src_addr、dst_addr、len、next_ptr、ctrl(包含中断使能、传输方向等)。状态机设计时要注意两个关键点:一是描述符读取和DMA传输可以流水(比如用双缓冲预取下一个描述符),二是地址跳变要兼容64位地址和大小端模式。带宽利用率方面,面试官常问“如果描述符读取慢怎么办”,可以答用outstanding transaction机制提前发送多个地址请求,或者用FIFO缓存描述符。开源代码我推荐看lowRISC的AXI DMA,代码风格清晰,注释也全,适合做练习。另外建议去GitHub搜“axi_dma_verilog”,有几个star高的项目都支持链式描述符,直接拿仿真跑一跑,重点观察地址波形和tlast信号配合。

我理解你说的痛点,描述符管理和地址跳变确实是区分你会不会做前端设计的点。简单说下我的系统准备框架:首先要明确AXI4-Stream的DMA和普通AHB DMA不同,它没有地址总线握手,全靠tvalid/tready流控,所以描述符里存储的是内存地址,而stream口只是数据通道。状态机设计建议采用三级流水:描述符获取级、地址生成及数据搬运级、状态回写级。每级之间用valid-ready握手解耦,这样带宽利用率高。描述符管理用链表时,要注意地址跳变其实是一个数学计算问题——给定起始地址和传输长度,要拆分成若干个burst,每个burst要满足AXI的地址对齐要求(比如burst大小为16字节,地址必须16字节对齐)。写一个地址生成器模块,输入起始地址和剩余长度,输出本次burst的地址、burst类型和大小。常见坑是当剩余长度小于burst大小时,要自动降级为较短burst,且地址不能跨4KB边界(AXI协议要求)。建议练习项目:用Verilog实现一个支持8个描述符的环状链表DMA,然后写testbench验证地址跳变正确性。可以参考openhwgroup的core-v-dma,它不仅有完整实现还有文档说明地址计算逻辑。最后提醒:面试时如果能手写出地址跳变的伪代码或者状态机转移图,会非常加分。

作为一位在IP验证方向工作了5年的工程师,我建议你从“理解AXI4-Stream与DMA的握手本质”切入。描述符管理的关键在于链表遍历状态机:你需要设计一个主控状态机,至少包含IDLE、FETCH_DESC、WAIT_DATA、GEN_ADDR、WRITE_BACK这几个状态。描述符链表通常存于系统内存,每个描述符包含源地址、目的地址、传输长度(字节数)和下一个描述符指针。地址跳变的核心是“地址对齐”和“burst长度计算”:对于AXI4-Stream,你要根据传输长度自动决定使用INCR还是FIXED类型burst,并且避免跨越4KB边界——很多公司笔试会考你如何用Verilog实现一个“边界检查器”。带宽利用率方面,建议你实现“预取描述符”和“乒乓描述符缓冲”,减少读描述符的空闲周期。推荐开源代码:Xilinx的AXI DMA v7.1的RTL源码(可下载阅读)或OpenCores上的“simple_dma”项目。笔试题常要求画出状态机图,建议你提前画清楚,并写出关键信号(如desc_fetch_done、addr_valid、burst_cnt)的时序图。最后注意:描述符的地址跳变如果涉及跨页,要插入“地址更新等待状态”,否则仿真会出协议错误。
发表回答
登录后可在本页底部提交回答