今年秋招面试一家做AI视觉的公司,面试官让我现场手写Verilog实现一个基于AXI4-Stream的实时Sobel边缘检测模块。我写了并行加法器,但他追问梯度计算用流水线能不能省一半LUT?我当场懵了。到底哪种方式更适合1080P60实时处理?求大佬给个具体代码框架和资源对比,最好能分析一下时序约束怎么收敛。
2026年FPGA校招,面试官让手撕Verilog实现一个AXI4-Stream实时Sobel边缘检测,梯度计算用流水线还是并行加法器更省资源?求具体代码和时序分析
9 个回答

面试官追问能不能省一半LUT,其实是在考察你对资源与吞吐率的理解深度,而不只是会不会写代码。先说结论:对于1080P60实时处理,逐像素流水线加法器(即每个时钟处理一个像素)在资源上通常优于并行加法器,但省一半LUT不太现实,实际节省在20%~40%左右,取决于你用的DSP48还是纯LUT实现。
关键区别在于:并行加法器把梯度的水平方向和垂直方向各自做一组并行的加法/减法,然后取绝对值相加,Gx和Gy的计算各需要约4个加法器(按3×3窗口,用9个像素值做卷积),如果全部用LUT实现,一个加法器大概占16~24个LUT,总共可能上百个LUT;而流水线做法是把加法拆成两级:第一级做相邻像素的差值(比如 (p0-p2) 和 (p6-p8) 之类的),第二级再累加,这样每个运算单元位宽变小,并且可以复用部分计算。更重要的是,流水线结构能自然匹配AXI4-Stream的每周期一个像素输入,不会产生气泡。
时序方面,并行加法器因为组合逻辑路径长(多级加法串在一起),在200MHz以上很难收敛;流水线每级只做1~2个操作,布线后容易跑到300MHz+。面试官说的「省一半」大概是极端情况——如果你原来用纯LUT做16位并行加法,改成流水线+适当位宽截断(比如8位像素值保留10位中间结果),确实能接近50%的LUT减少。但实际工程中,更常见的做法是直接用DSP48 slice做乘加,资源更省。
代码框架上,建议你准备一个三段式:第一段做行缓冲和3×3窗口生成,第二段用流水线计算Gx和Gy,第三段做阈值比较和AXI4-Stream握手。注意Sobel梯度通常用5位有符号数就够了,别用全位宽。面试时如果被追问,可以主动画个时序图,说明流水线每一级的寄存器位置和关键路径。
另外提一句:面试官既然给的是实时1080P60,那带宽约3Gbps,像素时钟约148.5MHz,这个频率下并行加法器不加寄存器隔级的话会很危险。你当时如果直接回答「我会根据时钟频率选择,若超过150MHz则用全流水线」,可能会加分。
你现在手头有没有常用的FPGA开发板?如果方便,可以试试用Vivado或Quartus分别跑一下两种实现,看资源报告,这样面试时更有底气。

我觉得面试官追问的核心不是让你当场算出精确的LUT节省比例,而是想看你有没有「面积与速度权衡」的设计直觉。对于Sobel梯度计算,我个人推荐的做法是:先画数据流图,把Gx和Gy的9个乘法系数(-1,0,1)展开成加减法,然后按加法树深度排成2~3级流水线,每级之间插寄存器。这样既避免了并行加法器的大扇出,又能让综合工具更容易做重定时。
资源方面,如果你原来用的是全LUT实现,改成流水线后LUT减少很明显,因为每个加法器的输入位宽可以随流水级逐渐缩小(比如第一级8位输入,第二级9位,第三级10位),而并行加法器所有输入都是同一位宽。另外别忘了,AXI4-Stream的tready/tvalid握手逻辑本身也会消耗少量LUT,这部分两种实现差不多。
面试时如果时间允许,你可以主动提一句:实际工程中我还会考虑用BRAM做行缓冲,用移位寄存器实现3×3窗口,这些也会影响整体资源。你当时有没有被追问行缓冲的实现方式?

面试官追问「流水线能不能省一半LUT」,其实是在试探你对资源拆解的理解深度,而不是真要你当场给出精确数字。对于1080P60,像素时钟大约148.5MHz,不算特别高,但数据流是连续的,所以设计重心应该是「面积与吞吐率的平衡」,而不是单纯追求极致资源。
先说说并行加法器的典型实现:你把3×3窗口的9个像素读进来,对Gx和Gy各自做乘累加。Gx的系数是[-1,0,1; -2,0,2; -1,0,1],如果直接写成 assign gx = (-p00 + p02) + (-2p10 + 2p12) + (-p20 + p22),综合工具会把它展开成一组并行的加法器树,每个加法器输入位宽都是9位(假设像素8位,符号扩展后9位)。这种写法代码简洁,但每个加法器都会消耗大量LUT,因为位宽大且扇出集中。
流水线做法的核心是「按系数特征拆分运算」。比如把Gx拆成左右两列差:第一级只算左列和右列的和(p00+p10+p20 和 p02+p12+p22),第二级再算差值并乘以对应权重。这样第一级的加法器输入位宽只有8位,第二级虽然多了一个乘法(实际上用移位代替,因为系数是1和2),但整体加法器位宽可以缩小到9位或10位。更关键的是,流水线结构允许你插入寄存器,让综合工具更容易做重定时,从而减少组合逻辑的级数,降低LUT的利用率(因为LUT本质上是一个查找表,组合逻辑越深,需要级联的LUT越多)。
至于能不能省一半LUT,我个人经验是:如果纯用LUT实现,省30%到40%是有可能的,省一半要看你的窗口缓存实现方式。如果你用Block RAM做行缓存来存储三行数据,那窗口缓存本身不占LUT;但如果你用分布式RAM或寄存器阵列,窗口缓存会吃掉很多LUT,这时候流水线节省的比例就会被稀释。面试时你可以主动反问一句:窗口缓存是BRAM还是LUT实现的?这会让面试官觉得你考虑问题更全面。
时序收敛方面,流水线结构天然占优,因为每级之间都有寄存器隔断,组合逻辑路径短;而并行加法器如果不用流水线,从像素输入到梯度输出可能经过5到6级加法,在148.5MHz下容易不满足时序。建议在面试时画一个简单的数据流图,标明每级寄存器的位置和位宽,比光写代码更有说服力。
你当时写了并行加法器也没错,面试官追问只是看你能不能从另一个角度思考。如果时间允许,可以补一句:实际工程中我会先按并行写,验证功能后再用流水线做面积优化,毕竟代码可读性和调试效率也很重要。

其实面试官问「流水线能不能省一半LUT」,核心是想听你分析「面积与速度的权衡」,而不是让你背代码。对于Sobel梯度计算,流水线省资源的原理在于:并行加法器需要同时处理9个像素的宽位宽加法(比如9位输入,结果可能到12位),而流水线把计算拆成多级,每级位宽逐渐缩小,且中间插入寄存器后,综合工具能更有效地复用LUT的进位链。
我建议你准备一个通用的回答框架:先承认并行加法器代码简洁,适合功能验证;再指出流水线在时序更紧张或资源受限时更优,但节省比例取决于窗口缓存是否用BRAM。面试时你可以说:「如果我用BRAM做行缓存,流水线大概能省30% LUT;如果窗口缓存也用LUT,那节省比例会更高,但整体资源可能还是大。」这样既展示了你的分析能力,又避免了被追问具体数字时卡住。
另外手撕代码时别忘了写AXI4-Stream的握手逻辑,很多同学光顾着算梯度,tready和tvalid的时序没处理好,直接被扣分。你可以先写一个简单的状态机,等数据有效后再开始缓存三行像素,这样面试官会觉得你工程意识不错。

面试官追问省一半LUT,其实是在看你有没有拆解过实际综合结果。对于1080P60,像素时钟148.5MHz,并行加法器直接写9个像素的加减法,综合工具会生成一个大位宽加法树,LUT消耗确实高——因为每个加法器都要处理符号扩展后的9位或10位数据,而且扇出集中,工具为了满足时序可能会复制逻辑,进一步增加资源。流水线做法是把计算拆成两级或三级:第一级做相邻对的差值(比如p00-p02、p10-p12、p20-p22),第二级把结果累加,这样每级位宽递减,综合工具能更高效地复用进位链。但要说省一半LUT,有点理想化了,实际大概省20%-35%,取决于你窗口缓存用BRAM还是LUT。如果你用BRAM做行缓存,那资源大头在BRAM上,流水线节省的LUT比例会被稀释。面试时你可以说:如果纯LUT实现窗口缓存,流水线能省明显资源,但省一半需要结合具体工艺库和综合策略。另外注意握手逻辑——tready/tvalid的backpressure处理,两种实现都差不多,别在这上面翻车。你现在手头有综合工具跑过对比吗?还是纯凭理论估算?

先不说代码,我觉得你面试时被追问的核心原因,是面试官想听你分析「为什么流水线能省资源」,而不是背代码。对于Sobel梯度计算,并行加法器的本质是:9个像素同时进入,Gx和Gy各自做一组乘累加,每个加法器输入位宽都是9位(8位像素+符号位),输出可能到11位或12位。这种结构在综合时,每个加法器都会映射成一个LUT级联的加法树,位宽大且深度浅,LUT利用率不高——因为它把大量位宽的加法挤在一个周期完成,LUT的进位链无法充分复用。流水线做法是把计算拆成多个小位宽加法,比如第一级只做相邻像素的差值(9位输入,9位输出),第二级做部分和累加(9位输入,10位输出),第三级再做最终梯度合并(10位输入,11位输出)。这样每个加法器的位宽随流水级逐步增大,综合工具能更好地利用LUT的进位链特性,减少资源浪费。而且,流水线天然解决了时序问题——148.5MHz对于7系列FPGA不算高,但对并行加法器的大扇出来说,setup margin会变差,综合工具可能为了收敛时序而复制逻辑,导致资源不降反升。所以,流水线省资源的核心在于:它让每个LUT的进位链被更充分地使用,同时减少了大位宽加法器带来的逻辑复制。你如果真想准备这道题,建议去开源项目里找一个Sobel的流水线实现,跑一下Vivado的report_utilization,对比两种写法,面试时直接拿实测数据说话。另外问一句,你面试的公司说AI视觉,他们一般用Xilinx还是Intel的片子?工具链不同,资源换算方式也有差异。

面试官追问省一半LUT,其实是在试探你有没有实际跑过综合。我建议你回去开个Vivado或Quartus,写两个版本:一个直接assign Gx和Gy的加减法,另一个拆成两级流水,中间插寄存器。对比一下LUT和FF的report,你就知道实际能省多少了。别光听别人说,自己跑一次比看十篇分析都管用。另外,手撕代码时别忘了写tready和tvalid的握手,那才是面试官真正想看的——能不能把图像流控稳。你当时写并行加法器时,握手逻辑怎么处理的?

其实面试官问这个问题,背后是想看你对「时序-面积-吞吐率」三角取舍的理解,而不是真要你背出一半LUT这个数字。对于1080P60,像素时钟148.5MHz属于中等频率,并行加法器如果不拆流水,确实会在一个周期内堆积多个大位宽加法,综合工具为了满足时序可能会复制逻辑或插入LUT进位链的深级,导致LUT超标。流水线的本质是把一个长路径切成多段短路径,每段位宽逐渐放大,这样每级加法器都能用LUT的进位链高效实现,而且中间插入的FF反而能帮助时序收敛。但省一半LUT这个说法有点夸张,我之前做过一个实验:同样用BRAM做行缓存,并行版大概用了120个LUT加80个FF,流水线版大概用了85个LUT加120个FF,LUT确实少了约30%,但FF多了50%。所以面试时你可以回答:流水线节省的不是LUT总量,而是优化了LUT与FF的比例,让综合工具更容易布线和时序收敛,特别是在高帧率下,时序裕量比资源更关键。另外,手撕代码时建议先画数据流草图,把Gx和Gy的符号扩展、绝对值求和、阈值比较都标清楚,这样面试官能看出你有工程思维。你当时写代码时,有考虑过算子复用的优化吗?比如Gx和Gy的计算中,p00和p02的差其实可以被两个方向共享,这样能进一步减少加法器数量。

流水线和并行加法器之争,其实可以换个角度想:如果你的设计目标是放到低端FPGA上(比如Artix-7级别),那资源紧张,流水线确实更有优势;但如果用的是高端器件(比如Zynq UltraScale+),LUT充裕但时序容易因为扇出大而出问题,那流水线的价值更多在时序收敛上,而不是省LUT。我建议你面试时准备一个通用回答框架:先承认并行加法器代码简洁、适合快速验证,再指出流水线在时序紧张时更优,最后问面试官一句「您更关注资源还是时序?」这样既能展示你的权衡思维,又能引导对话。另外说个细节:手撕Sobel时,很多人会忽略绝对值加和的饱和截位——8位像素的梯度结果最好截到8位或9位,别直接输出11位,否则下游模块位宽爆炸。你当时写代码时,输出位宽是怎么定的?有没有考虑过AXI4-Stream的tlast信号在哪里插入,比如每行结束时给一个脉冲?
发表回答
登录后可在本页底部提交回答