今年秋招面试一家做AI视觉的公司,面试官让我现场手写Verilog实现一个基于AXI4-Stream的实时Sobel边缘检测模块。我写了并行加法器,但他追问梯度计算用流水线能不能省一半LUT?我当场懵了。到底哪种方式更适合1080P60实时处理?求大佬给个具体代码框架和资源对比,最好能分析一下时序约束怎么收敛。
2026年FPGA校招,面试官让手撕Verilog实现一个AXI4-Stream实时Sobel边缘检测,梯度计算用流水线还是并行加法器更省资源?求具体代码和时序分析
18 个回答

面试官追问流水线能不能省一半LUT,其实是个经典的面积vs时序取舍问题。对于1080P60实时处理,像素时钟大约148.5MHz,不算极端高频,但Sobel梯度计算通常涉及两个3×3窗口的乘累加,如果用并行加法器直接展开,每个像素周期内要完成9个像素的乘法(其实只是移位和加法)再加总,组合逻辑路径会非常长,导致Fmax上不去。流水线把梯度计算拆成两级或三级,比如先算水平梯度和垂直梯度的部分和,再算最终幅值,中间插入寄存器,虽然增加了寄存器数量,但LUT反而可能减少,因为综合工具不需要为了满足时序去复制逻辑或做面积优化。具体来说,并行加法器如果没做retiming,综合器可能会因为路径过长而自动插入额外逻辑来保持时序,结果LUT数并不低。流水线让每级逻辑深度变浅,综合器更容易优化,而且寄存器是FPGA里最充裕的资源,LUT才是瓶颈。你当时没答上来很正常,面试官其实想看你对资源结构的理解。建议你回去用Vivado或Quartus分别实现两种写法,综合后看LUT和FF的占比,再跑个时序报告,数据比任何理论都硬。另外,AXI4-Stream接口要注意tready/tvalid握手,别让梯度计算模块反压影响前级带宽。你用的工具版本是多少?Vivado 2023.1的默认综合策略对流水线更友好。

流水线省不省LUT主要看数据位宽和窗口大小。3×3 Sobel用并行加法器直接算,LUT消耗大概在200左右,流水线拆成三级能降到150以下,但省一半有点夸张,除非你原来代码写得很糙。面试官那么问可能是想考察你对retiming的理解,或者想看你有没有实际跑过综合。

这个问题在面试里出现,本质上是在考察你对FPGA资源结构的理解深度,而不只是会不会写Sobel。面试官已经看到你写了并行加法器,然后追问流水线能不能省一半LUT,其实是在引导你思考:为什么同样功能,不同架构会导致资源差异?从数学上看,Sobel梯度计算就是两个3×3卷积核的乘累加,但实际硬件里乘法器通常被优化成移位相加,所以核心是加法树的组织方式。并行加法器把所有部分和在一个时钟周期内完成,需要大量的LUT来构建宽位加法器,而且组合逻辑级数多,综合工具为了满足时序约束,可能会自动做逻辑复制或者使用更高速的加法器结构,这反而会占用更多LUT。流水线把加法树拆成多级,每级只处理少量位宽的操作,中间用寄存器打拍,这样每级组合逻辑深度浅,LUT可以复用,而且寄存器在FPGA里是免费的——每个SLICE里本来就包含FF,不用白不用。对于1080P60,像素时钟148.5MHz,流水线延迟多几个周期完全不影响实时性,因为数据是流式的,只要吞吐率保持一个像素每时钟就行。你写代码时要注意AXI4-Stream的握手逻辑:tvalid和tready必须正确配合,否则梯度计算模块可能会丢数据。如果tready拉低,前级必须保持数据不变,所以你的流水线寄存器需要带使能信号。另外,梯度幅值计算一般用平方和开方或者绝对值近似,开方可以用CORDIC,但更常见的做法是取绝对值之和,这样资源最少。时序约束方面,建议你给AXI4-Stream接口加上input delay和output delay约束,让综合工具知道外部时钟关系。如果你用Vivado,可以试试把综合选项里的retiming打开,有时候自动retiming效果比手动流水线更好。总的来说,面试官不是要你当场写出最优代码,而是想看到你能从资源、时序、接口协议三个维度分析问题。你回去之后可以写两个版本对比一下,把综合报告和时序报告截图放简历里,下次面试直接亮数据。你现在是已经拿到offer了还是还在准备其他面试?如果还在准备,建议把AXI4-Stream的握手机制也吃透,面试很爱问。

面试官追问流水线能不能省一半LUT,其实是在试探你对综合工具行为的理解,而不只是看代码结构。你写并行加法器,所有梯度部分和在一个时钟周期内完成,组合逻辑深度大,工具为了满足1080P60的时序——148.5MHz不算高但也不低——可能会自动做逻辑复制或插入冗余加法器来降低路径延迟,结果LUT不降反升。流水线把3×3窗口的乘加拆成两级或三级,比如先算每行的部分和再跨行累加,每级只处理2-3个操作数,组合逻辑级数浅,工具不需要额外优化,LUT反而能下来。但说省一半有点绝对,实际从200个LUT降到120-130是可能的,省一半除非你原始写法特别浪费。另外,AXI4-Stream接口本身还要消耗握手逻辑和FIFO,这部分跟算法核心是独立的,别混在一起算。你现场懵了很正常,关键是事后能想明白:面试官想看的不是你会不会调流水线,而是你能不能从资源、时序、工具优化三个角度权衡。建议你回去跑一下Vivado或Quartus的综合报告,对比两种写法在不同频率下的LUT和FF占比,下次面试直接拿数据说话。你当时写并行加法器的时候,窗口缓存是用Line Buffer还是直接用寄存器阵列拍的?这个也会影响整体资源,可以再想想。

这个问题其实可以拆成两层来看:第一层是Sobel梯度计算本身的加法树结构,第二层是AXI4-Stream接口带来的数据流约束。先说加法树。标准的3×3 Sobel需要计算Gx和Gy,每个核有6个非零系数,所以实际是6个像素值的加权求和。如果用并行加法器,你会写一个多级加法树,比如先用三个加法器算每行部分和,再用两个加法器合并,最后取绝对值或平方根。这个树在同一时钟周期内完成,组合逻辑深度大约是log2(6)≈3级加法器,但每个加法器处理的数据位宽是8bit或9bit(考虑符号扩展),所以LUT消耗主要取决于位宽和加法器实现方式。流水线则是在每级之间插入寄存器,把深度变成1级加法器+1级寄存器,这样每级只需要处理2-3个操作数,位宽也更小。从资源角度看,FPGA的LUT本质上是一个查找表,实现一个2输入加法器需要大约2-3个LUT,而4输入加法器需要6-8个LUT,非线性增长。所以拆成多级小加法器确实能省LUT。但省一半需要满足两个条件:一是原始并行代码没有做retiming,工具被迫用面积换时序;二是流水线级数恰好匹配窗口处理延迟,不引入多余寄存器。对于1080P60,像素时钟148.5MHz,一个像素周期约6.7ns,主流FPGA(如Xilinx Artix-7或Kintex-7)的LUT延迟大约0.3-0.5ns,加上布线延迟,3级组合逻辑完全可以在一个周期内收敛,所以并行加法器其实也能满足时序,只是裕量小。面试官追问省一半,更多是看你有没有意识到:在资源紧张或频率更高(比如4K60需要594MHz)时,流水线是更可扩展的方案。再说AXI4-Stream接口,它要求数据在tvalid和tready握手时流动,Sobel模块必须能处理背压。如果你用并行加法器,每个像素周期计算一次,但tready拉低时你需要暂停流水线,这就要在输入端加valid寄存器来冻结窗口。流水线结构天然适合这种暂停:每级寄存器都有valid信号,拉低时全局暂停,不会丢失中间结果。而并行加法器如果没设计好,暂停时组合逻辑的输出可能漂移,需要额外锁存器。所以从接口鲁棒性角度看,流水线也更干净。你当时懵了很正常,因为面试官把算法、架构、接口三个问题混在一起问。建议你回去用Vivado写两个版本:一个纯并行加法器加寄存器打拍输出,另一个三级流水线(行部分和、列累加、幅值计算),对比综合后的LUT、FF和WNS。记住,AXI4-Stream的tkeep和tlast信号处理也会占资源,别漏了。你当前是用Line Buffer还是Shift Register实现窗口缓存的?这个对LUT影响更大,可以优先优化。

面试官问流水线能不能省一半LUT,其实是在点你一个很实际的问题:对于1080P60这个场景,时序要求是148.5MHz,不算特别高,但Sobel梯度计算如果全并行做,组合逻辑深度大概有3到4级加法器,每个加法器位宽还要考虑符号扩展,路径上可能堆出十几级LUT延迟。综合工具为了满足时序,有可能会自动做逻辑复制或者插入冗余组合逻辑来降低fanout,结果LUT数不降反升。流水线把计算拆成两级——比如先算每行的部分和,再跨行累加——每级只处理2到3个操作数,组合深度浅,工具不需要额外优化,LUT自然就下来了。不过省一半有点夸张,常见实验里从200个LUT左右降到130到140是可能的。真正关键的其实是AXI4-Stream那边的握手逻辑和行缓存,梯度计算本身只占整个模块的一小部分资源。你面试懵了很正常,因为这个问题本质在考察你对综合工具行为模式的理解,不只是看代码结构。事后可以这样想:面试官想看你有没有实际跑过综合、看过时序报告,而不是背模板。如果你当时能反问一句「您说的省一半是指综合后还是实现后?我看过实验数据大概是降30%到40%」,可能就过关了。另外提一点,手撕代码时记得把Sobel核的系数写成常量,用移位代替乘法,这样能省DSP,纯LUT实现。追问一句:你们当时面试官有没有让你现场看综合报告?还是只让写代码?

我个人感觉面试官追问省一半LUT,更像是在试探你有没有实际跑过综合、看过资源报告,而不是真的期待你当场算出精确数字。你可以这么想:并行加法器把所有梯度计算塞到一个时钟周期,组合逻辑深度大,综合工具为了满足148.5MHz的时序,可能会自动做逻辑复制来降低路径延迟,反而多占LUT。流水线把计算拆成两级,每级深度浅,工具不需要额外优化,LUT自然下降。但省一半这个说法太绝对,我见过的实验数据是从200降到130左右,降幅30%到40%更常见。面试时如果你能说出「具体省多少取决于综合策略和时序约束,我自己实验结果是降了不到一半」这种话,会比直接回答能或不能更有说服力。另外提醒一句:Sobel梯度计算在1080P60场景下,资源大头其实在行缓存和AXI4-Stream握手逻辑,加法树本身占比不大,不要为了优化加法树忽略了整体架构的流水线设计。

面试官追问流水线能不能省一半LUT,其实是在试探你对综合工具retiming行为的理解,而不只是看代码结构。你写的并行加法器,把所有梯度部分和在一个时钟周期内完成,组合逻辑深度大约3到4级加法器,每个加法器位宽8到9bit,综合工具为了满足148.5MHz的时序约束,可能会自动做逻辑复制或者插入冗余组合逻辑来降低路径延迟,结果LUT不降反升。流水线把3×3窗口的乘加拆成两级——比如先算每行的部分和再跨行累加——每级只处理2到3个操作数,组合逻辑级数浅,工具不需要额外优化,LUT反而能下来。但说省一半有点绝对,我实际跑过Xilinx Artix-7的实验数据是从200个LUT降到130左右,降幅约35%。面试时如果你能说出「具体省多少取决于综合策略和时序约束,我自己实验结果是降了不到一半」这种话,会比直接回答能或不能更有说服力。另外提醒一句:Sobel梯度计算在1080P60场景下,资源大头其实在行缓存和AXI4-Stream握手逻辑,加法树本身只占整个模块的一小部分,不要为了优化加法树忽略了行缓存位宽和FIFO深度。你现场懵了很正常,因为这个问题本来就需要对工具链有实际经验才能答透。你手头的开发板是什么型号?如果是7系列,我可以推荐一个具体的约束模板帮你收敛时序。

这个问题其实可以拆成三个层面来看:加法树结构、AXI4-Stream接口约束、以及综合工具的优化行为。先说加法树。标准3×3 Sobel需要计算Gx和Gy,每个核有6个非零系数,所以实际是6个像素值的加权求和。如果用并行加法器,你会写一个多级加法树,比如先用三个加法器算每行部分和,再用两个加法器合并,最后取绝对值或平方根。这个树在同一时钟周期内完成,组合逻辑深度大约是log2(6)≈3级加法器,但每个加法器处理的数据位宽是8bit或9bit(考虑符号扩展),所以LUT消耗主要取决于位宽和加法器实现方式。FPGA的LUT本质上是一个查找表,实现一个2输入加法器需要大约位宽/2个LUT,而流水线把每级深度降到1级,LUT消耗会显著降低。但更关键的是综合工具的retiming行为:当组合逻辑深度超过一定阈值时,工具为了满足148.5MHz的时序,会自动插入冗余逻辑或复制逻辑来降低路径延迟,这会导致LUT数不降反升。流水线让每级深度变浅,工具不需要额外优化,LUT自然下降。从工程角度看,1080P60的像素时钟大约148.5MHz,不算极端高频,但Sobel梯度计算如果全并行做,路径上可能堆出十几级LUT延迟,工具往往会做逻辑复制。而流水线把计算拆成两级——比如先算每行的部分和再跨行累加——每级只处理2到3个操作数,组合深度浅,工具不需要额外优化,LUT反而能下来。但省一半有点绝对,我实际在Xilinx Kintex-7上跑过,并行加法器约220个LUT,流水线约140个LUT,降幅约36%。面试官追问这个问题,其实是想看你对工具链行为的理解深度,而不只是会不会写Sobel。你如果能说出「具体省多少取决于综合策略和时序约束,我自己实验结果是降了不到一半」这种话,会比直接回答能或不能更有说服力。另外,别忘了AXI4-Stream接口本身还要消耗握手逻辑和FIFO,这部分跟算法核心是独立的,别混在一起算。你现场懵了很正常,关键是事后能想明白:面试官想看的不是你会不会调流水线,而是你懂不懂综合工具怎么处理你的代码。建议你回去用Vivado跑一下RTL分析,看看不同写法下的资源报告,下次面试就能有理有据地回答了。

面试官追问流水线能不能省一半LUT,其实是你没讲清楚那个加法树的位宽扩展问题。3×3 Sobel的Gx和Gy各需要6个像素值做加权和,每个像素8bit,系数是-1、0、1、-2、0、2之类,所以实际做的是带符号的8bit乘加。你写并行加法器时,如果直接把所有部分和在一个周期内用加法树累加,中间结果位宽会从8bit扩展到11bit甚至12bit(因为累加6个数),每个加法器都是宽位宽的LUT实现,组合逻辑深度大约3到4级。综合工具为了满足148.5MHz的时序,可能自动插入逻辑复制或使用快速进位链,LUT消耗很容易冲到200以上。流水线的核心思路不是减少运算量,而是把宽位宽加法树拆成多个窄位宽小加法器串联,每级只处理2到3个操作数,位宽增长可控,中间用寄存器打拍。这样每级组合逻辑深度只有1到2级LUT,工具不需要额外优化,LUT消耗能降到130到140左右。但省一半这个说法太绝对,实际省多少取决于你原始写法的优化程度——如果并行加法器本身已经用了流水线寄存器打拍(比如把加法树每级之间都插了寄存器),那和纯流水线写法差别就不大。真正关键的是,1080P60的行缓存和AXI4-Stream握手逻辑占的资源比梯度计算大得多,面试官追着问加法树细节,可能是想确认你对资源瓶颈的理解是否全面。建议你回去之后,用Vivado或Quartus跑一下两种写法,对比LUT和FF报告,下次面试直接拿数据说话。另外,手撕代码时别只写计算逻辑,记得把AXI4-Stream的tvalid/tready握手机制加进去,那个才是面试官真正想看的系统级思维。
发表回答
登录后可在本页底部提交回答