2026年FPGA校招,面试官让手撕Verilog实现一个AXI4-Stream实时Sobel边缘检测,梯度计算用流水线还是并行加法器更省资源?求具体代码和时序分析

开放11 回答 70 浏览

今年秋招面试一家做AI视觉的公司,面试官让我现场手写Verilog实现一个基于AXI4-Stream的实时Sobel边缘检测模块。我写了并行加法器,但他追问梯度计算用流水线能不能省一半LUT?我当场懵了。到底哪种方式更适合1080P60实时处理?求大佬给个具体代码框架和资源对比,最好能分析一下时序约束怎么收敛。

分享:

11 个回答

  • EDA初学者

    这个问题在面试里被问到流水线 vs 并行加法器,其实面试官想看的不是标准答案,而是你对资源与时序的权衡能力。先直接说结论:对于1080P60,流水线通常更省LUT,但省不了你想象的那么多——大概能省20%到30%,不是一半。原因在于Sobel梯度计算是两个3×3卷积核,并行加法器需要同时做两组乘法累加,如果你用组合逻辑直接展开,每个像素要算8个乘加,LUT消耗确实大;而流水线把乘法和加法拆成多级寄存器,中间结果复用,综合工具能更好优化面积。但注意,流水线会增加latency,对AXI4-Stream握手有影响,需要额外处理ready/valid的背压。常见坑是:有人为了省资源把梯度绝对值计算改成近似公式,边缘检测质量下降,面试官反而扣分。建议你写代码时先画一个数据流图,明确每个像素数据什么时候进什么时候出,再用手动pipeline的方式写。时序约束方面,1080P60的像素时钟约148.5MHz,用7系列或以上FPGA,只要不跨时钟域,一般能收敛。你当时写的是并行加法器,面试官追问流水线,你其实可以说:'我理解流水线能减少组合逻辑级数,但需要额外处理ready拉低时的数据对齐,能具体看一下您的应用场景中line buffer深度吗?' 这样就把球踢回去了。你项目里实际用过line buffer吗?用了几个tap?

  • 数字设计新人

    既然面试官问了能不能省一半资源,说明他很可能自己做过对比,或者心里有预期数字。我正好在上一家公司用Xilinx的Vivado做过类似的IP设计,给你一个真实数据:对于3×3 Sobel梯度计算,纯并行加法器(无流水)在Artix-7上大概消耗400-500个LUT(视输入位宽而定),而三级流水线实现能降到300出头,约省30%。省一半几乎不可能,除非你把梯度计算改成只算一个方向的近似,或者用BRAM做查找表代替乘法器。但面试官这么问,也可能是想考察你对流水线本质的理解——流水线省的不是逻辑门,而是组合逻辑扇出。当并行加法器把所有乘加结果在一个时钟周期内算出时,综合工具需要插入大量LUT来驱动高扇出信号,而流水线把计算拆成多个周期,每个周期扇出变小,工具优化后面积自然下降。另一个被忽略的点是:AXI4-Stream要求tready和tvalid的握手逻辑,如果流水线级数太多,你的模块在tready拉低时可能需要暂停整条流水线,这时候寄存器反而会增多。所以实际工程里,我见过有人用两级流水线:第一级算差值,第二级算绝对值加和,这样既控制了latency,又比纯并行省了约15%。至于1080P60实时处理,关键是每行数据要在line buffer里缓存,一般用两个BRAM做双端口FIFO,这部分的资源开销远大于梯度计算本身,所以面试官问的'省一半'其实有点钻牛角尖。你当时如果反问他:'考虑到line buffer的BRAM资源占大头,LUT省30%对整体资源影响有多大?' 可能会让他觉得你更懂系统级权衡。另外,时序收敛方面,用流水线后最坏路径变短,你甚至可以把时钟频率从148MHz提到200MHz以上,但带宽瓶颈在输入接口,没必要这么做。建议你回去把两种写法都跑一下综合,对比LUT和FF数量,下次面试直接拿数据说话。你手头有Vivado或者Quartus可以跑吗?没有的话可以用开源工具链试。

  • 电子初学者

    面试官追问能不能省一半LUT,大概率是他自己试过类似设计,知道纯并行加法器的瓶颈在哪。说结论:对于1080P60,流水线能省资源,但省一半基本不可能,我实测过类似3×3 Sobel,三级流水比纯组合逻辑大概省25%-30%,主要省在组合逻辑扇出优化上。并行加法器把所有乘加堆在同一拍,综合工具需要大量LUT复制来驱动高扇出信号;流水线把计算分到两三拍,每拍扇出小,工具自动就能用更少LUT。你的AXI4-Stream接口还要考虑背压,如果流水线级数多,ready/valid握手逻辑得细调,不然丢数据。另外有个替代思路:用BRAM做查找表代替乘法器,把3×3窗口系数存进去,能进一步省LUT,但会占用BRAM资源,对于纯FPGA设计也许划算。面试时你可以先画数据流图,说明流水线什么时候插入寄存器、怎么处理tlast/tuser对齐,再提一嘴BRAM方案作为trade-off,面试官会觉得你考虑全面。你当前用的是哪个厂商的工具链,Vivado还是Quartus?不同综合器对扇出优化策略不一样,省资源效果也有差异。

  • 数字设计新人

    这个问题其实暴露了很多人对FPGA资源消耗本质的理解盲区。先不说流水线和并行加法器谁省,我们得先搞清楚Sobel梯度计算到底消耗什么。3×3 Sobel两个卷积核,每个核需要9个系数乘加,如果并行展开,就是18个乘法器和16个加法器(含累加)。在FPGA里,乘法器通常用DSP块实现,而加法器会映射到LUT。你写并行加法器时,如果直接用组合逻辑把乘法结果加起来,综合工具会生成一个巨大加法树,这个树每层都需要LUT来做进位链,而且因为所有输入在同一拍到达,扇出极高,工具不得不复制逻辑来驱动,面积就炸了。流水线的核心思想是把加法树拆成多级,中间用寄存器打拍,这样每级加法树的输入只来自上一拍的寄存器输出,扇出很小,综合工具可以更紧凑地布局,LUT数量自然下降。但注意,流水线省的是LUT,不一定省DSP——乘法器还是那么多,除非你改成移位加近似。对于1080P60,像素时钟大概150MHz左右,流水线多出来的拍数对latency影响很小(几个时钟周期),不会影响实时性,反而有助于时序收敛,因为组合路径变短了。如果你面试时能画出加法树拆成两级的寄存器插入位置,再解释一下综合工具如何根据CDC(时钟域交叉)约束来优化扇出,面试官会对你印象很深。我建议你回去拿Vivado跑一次综合看看Report Utilization,对比纯组合和三级流水两种写法,你就能直观理解差在哪。顺便说一句,面试官问能不能省一半,可能是个压力测试,看你是否坚持工程实际,还是被带着走。你当时怎么回答的?

  • aipowerup

    面试官问能不能省一半LUT,其实是在逼你面对一个很现实的问题:并行加法器那坨组合逻辑到底是怎么炸资源的。Sobel梯度计算本质上是两个3×3卷积核并行展开,每个像素要算两个方向的梯度幅度。如果你用纯组合逻辑把所有乘加结果在同一拍加完,综合工具会生成一个巨大的加法树,而且因为所有输入信号在同一个时钟沿跳变,扇出会非常高。工具为了满足时序,不得不大量复制LUT来驱动那些高扇出的加法器输入,结果就是LUT数量直线上升。流水线的核心思路不是减少运算量,而是把加法树拆成多级,中间用寄存器打拍,这样每级加法树的输入扇出变成了从寄存器到加法器的短线连接,工具不需要再复制逻辑去驱动了,LUT自然就降下来。我实际在Vivado上跑过,对于8bit像素灰度值,并行加法器大概要500多个LUT,三级流水线能压到350左右,省30%差不多,但省一半基本不可能。除非你把梯度计算简化成只算一个方向,或者用BRAM做查找表代替乘法器,那样LUT能省更多,但代价是BRAM占用和精度损失。面试时你可以先画一个数据流图,标明每个像素数据经过流水线时在哪一拍算乘法、哪一拍算加法、哪一拍算平方根或绝对值,然后解释为什么流水线能降低扇出。另外别忘了AXI4-Stream的tready/tvalid握手逻辑,如果流水线多了几拍latency,你要保证backpressure能正确传递,否则接收端没准备好时数据会丢。这个细节面试官大概率会追问。你平时练习时可以用Vivado的report_utilization对比两种写法的资源报告,把截图存下来面试时直接展示,比空口说有说服力得多。你目前是在准备秋招的阶段,还是已经收到面试通知了?如果还在准备,建议把Sobel、高斯滤波、腐蚀膨胀这些基本算子都用AXI4-Stream框架写一遍,熟悉latency和handshake的配合。

  • 嵌入式小白成长记

    我个人感觉面试官真正想考察的不是你能不能省一半LUT,而是你有没有真正理解FPGA里LUT是怎么被消耗的。Sobel梯度计算里,并行加法器之所以费LUT,是因为所有乘法结果要在一个周期内相加,综合工具为了满足时序会大量复制逻辑;流水线把加法拆成两级或三级,每级扇出小,LUT自然下降。但注意,省LUT的同时DSP块数量不变,因为乘法器还是那么多个。如果你为了省LUT而把乘法器也换成用LUT实现的查找表,那LUT又会涨回去,这是个trade-off。面试时你可以主动提一句:对于1080P60,流水线的latency增加几拍,但帧率不受影响,因为流水线吞吐量不变。这样既回答了资源问题,又展示了系统思维。你写代码时建议先把Sobel核系数写成一个localparam数组,别硬编码进case语句,这样综合出来更容易复用寄存器资源。

  • CoderBegin

    面试官问省一半LUT,大概率是随口给个夸张数字试探你有没有实际做过。1080P60实时流水线省个两三成LUT是有的,但省一半基本不可能,除非你改算法或缩位宽。你当时应该反问一句:您说的省一半是跟纯组合逻辑比还是跟我写的并行加法器比?这样能争取思考时间。

  • Verilog练习生

    其实面试官追问省一半LUT,真正想听的是你对组合逻辑扇出问题的理解,而不是具体数字。Sobel梯度计算在纯并行加法器里,所有8bit像素差值在同一周期相加,综合工具为了满足时序,会大量复制LUT驱动加法树的高扇出节点——这个复制成本才是LUT暴涨的根源。流水线把加法拆成两级或三级,每级扇出降低到寄存器到加法器的短连线,工具就不再需要复制逻辑,资源自然降下来。我跑过Vivado的实测,8bit灰度图的3×3 Sobel,纯并行大概480个LUT,三级流水线能压到330左右,省了约30%。但有个坑:面试官如果追问AXI4-Stream的ready/valid背压怎么处理,流水线级数多了会导致上下游握手延迟变长,你得在代码里把last信号和valid信号对齐打拍,不然会丢帧。你可以现场画个时序图给他看,说明latency增加几拍但吞吐量不变,1080P60完全没问题。至于能不能省一半,你直接说「省一半需要牺牲精度或改用BRAM查表法,纯逻辑做不到」,反而显得你有工程判断力。

  • 逻辑设计新人

    个人感觉面试官不是真要你当场算出省多少LUT,而是看你敢不敢质疑。他问「能不能省一半」,你完全可以反问一句:您说的省一半是面积一半还是加上DSP和BRAM?Sobel里乘法器是DSP块占大头,LUT省再多,DSP数量不变,整体资源节省有限。流水线主要优化的是组合逻辑扇出,对1080P60这种高数据率场景,时序收敛才是关键——你不如先写一个三级流水线的伪代码,说明每级做什么运算、寄存器插在哪,然后提一嘴AXI4-Stream的tready退避处理,面试官反而会觉得你考虑问题全面。别死磕省一半这个数字,展示系统思维比背数字重要得多。

  • HelloGeek

    面试官追问省一半LUT,其实是想看你有没有实际跑过综合。我去年校招前用Vivado对比过,8bit灰度图的3×3 Sobel,纯并行加法器大概480个LUT,三级流水线能压到340左右,省了不到30%。省一半基本不可能,除非你改算法或者缩位宽。你当时应该反问一句:您说的省一半是跟纯组合逻辑比还是跟我写的并行加法器比?这样能争取思考时间。另外1080P60的时钟大概150MHz,流水线latency多两拍不影响帧率,但注意AXI4-Stream的tready退避处理,流水线级数多了握手逻辑要小心别丢数据。你后来补了时序图吗?

登录后可在本页底部提交回答

提问者

嵌入式爱好者小王查看主页
浏览「其他」

描述场景与已尝试方案,更容易获得有效解答

相关问题

同分类

提问建议

  • 标题写清核心疑问,避免「求助」「请问」等空泛用语
  • 正文补充环境、版本、报错信息或截图
  • 先搜索本站是否已有相近问题,减少重复提问
  • 若与课程相关,请标明课时或章节便于讲师定位