2026年FPGA校招,面试官问手撕Verilog实现AXI4-Stream实时视频拼接,多路输入帧对齐怎么用流水线设计才能不漏帧?

开放10 回答 62 浏览

今年秋招面了一家做视频处理的芯片公司,面试官上来就让手撕Verilog实现一个AXI4-Stream的实时视频拼接模块,要求处理4路1080P输入,输出4K分辨率。我卡在了多路帧对齐的流水线设计上,面试官追问怎么保证每路数据在拼接时不会因为时钟域不同而漏帧或错位。有没有大佬分享下这种多路视频拼接的帧对齐流水线架构?最好能给出具体的状态机设计思路和缓冲深度计算方法,万分感谢!

分享:

10 个回答

  • 嵌入式小白

    面试官问帧对齐,其实核心就一句话:让四路视频在同一个时间参考系里握手。你提到时钟域不同,那第一步不是上FIFO,而是先确认四路是否都带独立有效信号和行场同步。常见做法是每路进来先检测帧起始标志(比如场同步下降沿或者用户自定义的TUSER位),一旦检测到,就产生一个本地帧同步脉冲。四路的脉冲都同步到主时钟域后,用一个仲裁状态机等待所有路的脉冲都到齐,再统一发出'开始拼接'的使能。这个使能同时打开四路的读指针,从各自的异步FIFO里读出第一行数据。至于缓冲深度,最保险的算法是:最大帧行数差加上一行像素的余量。1080P一般1125行(含消隐),如果四路中最快和最慢的行数差不超过两行,那缓冲深度设成2行×1920像素×3字节就够了。但面试官追问的'不漏帧',其实更考验你对背压的处理——AXI4-Stream的ready/valid握手必须每级都做,不能因为某路FIFO快满就丢掉后续数据。我建议你画一个三级流水:第一级是路内帧检测+异步FIFO,第二级是主时钟域帧同步仲裁,第三级是像素级拼接输出。状态机可以简化为IDLE、WAIT_SYNC、READ_ROW、OUTPUT四个状态,重点在WAIT_SYNC里要加超时退出机制,否则某路信号异常会导致整个模块死锁。另外,面试官可能还会问多路数据对齐后如何确保像素顺序正确,你可以提行缓冲+行计数器校验,每读完一行就对比各路行号是否一致。你当时有被问到具体用哪种FPGA器件吗?不同器件的BRAM容量会影响缓冲深度选择。

  • 嵌入式入门生

    手撕这种题,面试官其实不指望你现场写出完整代码,他更想看你的思路是否务实。四路帧对齐的关键在于'等待最慢的那一路'——用计数器记录每路从帧起始到有效数据开始的延迟,取最大值作为公共启动点。流水线设计上,我推荐用两级乒乓FIFO:第一级做跨时钟域,第二级做行对齐。状态机不用太复杂,IDLE检测所有路的帧起始,一旦检测到就进入ALIGN状态,等所有路的行计数器都达到预设的偏移值,再一起切到OUT状态。缓冲深度计算有个简单公式:深度 = 最大行延迟差 × 一行像素数 + 安全余量(建议多留半行)。1080P一行约2200个时钟周期(含消隐),如果四路最大相差10行,深度就是22000像素,用BRAM实现绰绰有余。另外面试官问'不漏帧',你可以提到在拼接输出前加一个校验FIFO,每帧数据头带CRC,输出端验证完整后再释放。你当时面试的公司是做安防还是消费电子?不同场景对延迟要求不一样,会影响FIFO深度选择。

  • 面向百度

    面试官问这个,其实他真正想听的并不是你能把四个FIFO排成一排然后一股脑全读出来。四路1080P拼接成4K,帧对齐的核心矛盾在于:各路数据到达主时钟域的时刻是随机的,而且每路的行场同步相位也可能不同。如果你直接用一个全局使能信号去同时拉四路的读使能,大概率有一两路读到的数据是上一帧的尾巴,这就漏帧了。我自己的做法是,每路进来先过一级异步FIFO做时钟域转换,这步没得省。然后重点在帧起始检测:不要只看场同步的边沿,因为场同步可能被消隐期拉得很宽,容易误判。更靠谱的是检测每路自定义的TUSER位——如果协议允许,可以在每帧的第一个像素位置拉高TUSER,这样你在主时钟域里用上升沿采样,四路信号都采样到之后,用一个计数器记下各自到达的时钟周期差,取最大值作为公共等待延时。这个延时决定了你在主时钟域里什么时候统一打开所有路的读指针。缓冲深度不能只算一行,因为最慢的一路可能比最快的一路晚来了好几行。一个安全的做法是:先估算四路中行数偏差最大的差值,比如差两行,那深度至少设成两行像素数加半行余量。1080P一行1920像素,RGB格式下每像素24bit,两行就是92160bit,用BRAM完全装得下。状态机我建议只用三个状态:IDLE等待所有路TUSER有效,ALIGN等待公共延时计数器归零,OUTPUT持续读出直到检测到下一帧的TUSER到来再跳回IDLE。这样不会漏帧,因为ALIGN阶段所有路都在各自的FIFO里缓着,读指针没动过。面试官追问不漏帧的时候,你可以反问一句:如果某路突然丢了一帧场同步怎么办?这能展示你对异常处理的思考。你目前有实际的仿真波形图可以贴上来看看吗?我想确认你那个异步FIFO的读写时钟频率差别大不大。

  • 电子工程学生

    我去年也面过类似的问题,当时面试官直接让我在白板上画流水线框图。我的理解是,帧对齐其实可以拆成两个子问题:跨时钟域同步和行起始对齐。跨时钟域用异步FIFO解决,这没什么好说的。行起始对齐才是容易漏帧的地方——因为四路视频的消隐期长度可能不一样,如果你只对齐了场同步,但没对齐行同步,拼接出来的图像会一行错位。我的做法是,在主时钟域里为每路维护一个行计数器,从帧起始开始对行有效信号计数。当四路的行计数器都达到预设的偏移值(比如某路需要多等三行才能跟其他路对齐),才允许这一行数据进入拼接逻辑。这样即使某路消隐期多几行也不会漏帧,因为数据一直在FIFO里排队。缓冲深度就取最大行偏移值加上一行余量。面试官当时还追问了如果某路数据流中断怎么办,我说可以加一个超时计数器,超过一行时间还没收到有效数据就报错并强制丢弃当前帧。这个思路他挺认可的。你现在用的FPGA开发板型号是什么?如果是Xilinx的,可以直接用原语例化异步FIFO,省得自己写跨时钟域逻辑。

  • 电子系小白

    面试官问帧对齐,你第一反应别直接去写FIFO深度的公式,他更想看你有没有想过'漏帧'到底是怎么漏的。四路1080P进到一个主时钟域,最容易翻车的地方是:某一路的场同步信号因为跨时钟域打了两拍,结果比别的路晚了一个周期才被识别,导致这路的第一行数据还没进FIFO,其他三路已经开始往外读了——那这路的第一帧就永远少了一行。破解方法是给每路单独设一个帧起始标志检测模块,用TUSER或场同步下降沿触发,然后在主时钟域里用一个计数器记录四路标志到达的时刻差,取最大值作为公共等待周期。状态机可以简化为两个状态:WAIT和RUN。WAIT里等待所有路的帧起始标志都到位,并且计数器走到最大延迟值,然后一起跳到RUN,同时拉高四路FIFO的读使能。缓冲深度别死磕公式,实际工程里更稳妥的做法是先仿真看最大行偏移量,再加50%余量,因为消隐期长度在不同输入源里可能差到几十行。你还可以加一个看门狗计数器,超过两行时间还没等到某路数据就主动丢弃当前帧,避免死锁。追问一句:你的项目里四路输入是同一个晶振分出来的,还是各自独立晶振?这个会影响你要不要做CDCRESET同步。

  • 硬件萌新

    我个人觉得,面试官出这道题其实是想看你有没有'视频流水线'的整体意识,而不只是会写FIFO例化。四路1080P拼4K,帧对齐的难点不在于跨时钟域,那玩意儿随便一本教材都有标准解法,难的是怎么在拼接过程中处理'行错位'和'帧尾残留'。举个例子:假设四路输入的行有效信号长度完全一样,但某一路因为上游模块处理慢了半拍,它的场同步下降沿比别的路晚了200个时钟周期。如果你只对齐帧起始就开读,那这路的第一行数据会跟其他路的第二行数据拼在一起,图像直接撕裂。真正不漏帧的做法是在帧起始对齐之后,再加一级行级对齐:每路维护一个行计数器,从帧起始开始累计行有效脉冲数,只有当四路的行计数值都到达同一个偏移量时,才允许这一行的数据进入拼接FIFO。偏移量的计算方法是用一个最大值寄存器记录四路第一行数据到达主时钟域的时钟周期差,然后让快的路等慢的路,等够那个差值再开始读。这样即使某路消隐期多了几行,也只是在FIFO里多等一会儿,不会漏掉任何像素。状态机可以设计成三个状态:IDLE检测帧起始、ALIGN等待所有路行计数器对齐、OUTPUT正常输出拼接数据。缓冲深度不要按帧来算,按行来算更合理:深度 = 最大行延迟差 × 一行像素数 + 一行余量。1080P一行大约2200个像素(含消隐),如果四路最大相差两行,那深度就是4400像素,用一块BRAM就够。面试官如果追问'万一某路数据永远不来了呢',你就说加一个超时计数器,超过三行时间没等到有效行,就强制复位状态机并报错,同时输出上一帧的缓存数据保画面不黑。最后,面试时记得强调你的设计里每一路FIFO的读指针是独立控制的,直到对齐信号有效才一起更新,这样能从根本上避免错位。你现在用的仿真工具是Vivado还是VCS?不同的工具对异步FIFO的初始化行为有细微差别,可能会影响对齐逻辑的时序收敛。

  • Python学徒

    面试官问帧对齐,说白了就是让四路视频在同一个时间起点上一起开始读。最简单可靠的流水线是:每路进来先过异步FIFO转时钟域,然后各自检测帧起始标志(比如场同步下降沿),检测到后发一个脉冲给主时钟域。主时钟域里用一个计数器记录四路脉冲到达的时间差,取最大值作为公共等待周期,等所有路都到位了再统一拉高读使能。缓冲深度就按最大行偏移量加一行余量算,1080P一行1920像素,深度设个2048就够了。状态机两个状态:WAIT等待所有帧起始,RUN正常读数据。这样设计基本不会漏帧。你当时是怎么处理行有效信号对齐的?

  • 码逻辑的小王

    你卡在帧对齐上,其实很多校招生都栽这儿,因为教材里只讲单路FIFO,没人教多路怎么握手。我建议你把问题拆成三个层次来看。第一层是时钟域转换,每路AXI4-Stream进来先接一个异步FIFO,深度至少能存两行数据,这是为了吸收跨时钟域抖动和消隐期差异。第二层是帧起始对齐,别只盯着场同步信号——AXI4-Stream协议里TUSER位可以自定义,很多视频IP会在帧首的第一个像素把TUSER拉高,这个信号比场同步更精确,因为它跟数据是同步的。你在主时钟域里给每路设一个边沿检测,检测到TUSER上升沿就置位一个标志寄存器,然后用一个4位宽的计数器去算四路标志都置位时各自相差多少周期,取最大值作为公共等待周期。第三层是行级对齐,这一步最容易漏帧:假设某一路因为前级处理慢了半拍,它的第一行数据晚到了10个时钟周期,但其他三路已经读到第一行末尾了。如果你只对齐帧起始就开读,那这路的第一行会跟别的路的第二行拼在一起。解决办法是在帧对齐之后,每路再维护一个行计数器,从帧起始开始对TLAST(行尾标志)计数,只有当四路的行计数值都到达同一个偏移量时,才允许这一行的数据进入拼接逻辑。这个偏移量就是你在帧对齐阶段算出来的公共等待周期。缓冲深度取最大行偏移量乘一行像素数再加半行余量,1080P一行1920个有效像素,如果你仿真出来最大偏移是5行,深度设9600个像素就够。状态机可以做成三层嵌套:外层是帧同步状态机(IDLE-WAIT-RUN),中层是行同步计数器,内层是像素流水线。面试官如果追问超时处理,你就说加一个看门狗计数器,超过两行时间还没收到TUSER就报错丢弃当前帧。你当时面试官有没有追问跨时钟域打拍的具体级数?

  • 电子工程学生

    个人感觉面试官真正想看的不是你会写FIFO例化,而是你有没有想过'漏帧'到底是怎么漏的。举个例子:四路1080P输入,某一路的TUSER因为跨时钟域打了两拍,比别的路晚了两个周期才被主时钟域识别,结果其他三路已经读走了两行数据,这路的第一行就直接被跳过了——这就是漏帧。避免方法很简单:在WAIT状态里用一个4位计数器记录四路TUSER到达的时刻差,取最大值作为公共启动偏移,然后在RUN状态开始前先根据这个偏移量预读FIFO里对应行数的数据但不输出,等偏移消耗完再统一输出。这样即使某路晚到,它的数据也不会丢,只是延迟了一两行输出。缓冲深度按这个偏移量加一行算,别死磕公式,实际工程里更推荐先仿真跑最大偏移再留余量。另外注意AXI4-Stream的TREADY背压,拼接模块输出端如果接DDR写控制器,TREADY可能会拉低,这时候所有路的流水线都得暂停,否则会丢数据。你面试时有没有讨论背压处理?

  • 面向百度

    说实话,面试官问这个,他真正想看的不是你会不会用FIFO,而是你有没有想过'漏帧'到底是怎么漏出来的。四路1080P拼4K,最经典的翻车场景是:某一路的TUSER因为跨时钟域打了两拍,比别的路晚了两个周期才被主时钟域识别,结果其他三路已经读走了两行数据,这路的第一行就直接被跳过了——这就是漏帧。避免方法其实不复杂:在WAIT状态里用一个4位计数器记录四路TUSER到达的时刻差,取最大值作为公共启动偏移,然后在RUN状态开始前先根据这个偏移量预读FIFO里对应行数的数据但不输出,等偏移消耗完再统一输出。这样即使某路晚到,它的数据也不会丢,只是延迟了一两行输出。缓冲深度按这个偏移量加一行算,别死磕公式,实际工程里更推荐先仿真跑最大偏移再留余量。另外注意AXI4-Stream的TREADY背压,拼接模块输出端如果接DDR写控制器,输出端可能会被反压,这时候如果某路FIFO已经快空了,但你还在等别的路对齐,就会产生读空错误。所以状态机里最好加一个超时保护:在ALIGN状态如果等待超过一行的时间,就强制把当前路的数据丢弃并重新同步下一帧。你写Verilog的时候,是把TUSER和TDATA分开处理,还是统一用状态机控制的?

登录后可在本页底部提交回答

提问者

BugHunter查看主页
浏览「就业招聘」

描述场景与已尝试方案,更容易获得有效解答

相关问题

同分类

提问建议

  • 标题写清核心疑问,避免「求助」「请问」等空泛用语
  • 正文补充环境、版本、报错信息或截图
  • 先搜索本站是否已有相近问题,减少重复提问
  • 若与课程相关,请标明课时或章节便于讲师定位