2026年FPGA校招,手撕Verilog实现AXI4-Stream实时视频边缘检测,Sobel算子用流水线怎么设计才能满足1080P60?求具体代码框架

开放10 回答 60 浏览

面试官让我手写一个基于AXI4-Stream的Sobel边缘检测模块,要求1080P60帧率,流水线设计。我写了行缓冲和梯度计算,但他说我的延迟太大,丢帧了。求大佬给个具体代码框架,包括行缓冲深度、流水线级数、边界怎么处理,最好能直接套用的Verilog模板。

分享:

10 个回答

  • 芯片小白

    既然你在校招面试里遇到了手撕Sobel,说明面试官想看的不是你背模板,而是你对流水线时序和AXI-Stream握手的理解。1080P60意味着每行1920像素、每秒60帧,像素时钟大约150MHz左右,行缓冲深度固定为3行就够了——因为Sobel的3×3窗口只需要暂存当前行、上一行和上上行。你的延迟问题大概率出在行缓冲的读写控制上:很多学生会把行缓冲做成一个完整的FIFO,每来一帧就清空重写,但实际AXI-Stream是连续流,你需要用双端口RAM或移位寄存器实现行缓冲,读地址永远比写地址提前一行宽度。流水线分4级是对的,但要注意第1级行缓冲写入时,tready信号必须反压给上游,否则上游连续发数据会撑爆行缓冲。边界处理用复制最省资源,就是第一行和最后一行、第一列和最后一列直接复制相邻像素值,这样你不需要额外加边界判断逻辑。代码框架上,我建议你先写一个行缓冲模块,例化两个RAM,每个宽度8bit深度1920,然后顶层里实例化三个行缓冲分别存三行数据。窗口提取就是每来一个像素,从三个行缓冲里同时读出对应列的三个像素再加上当前像素的左右邻居,组合成3×3矩阵。梯度计算和阈值判断都是组合逻辑或者单级流水,注意梯度绝对值求和后比较阈值,输出二值图像。面试时如果你能画出时序图说明每一级延迟了多少个时钟周期,比直接背代码更有说服力。另外,丢帧的另一个常见原因是你的模块没有处理帧同步信号,你需要把tuser(帧起始)信号在流水线里打拍对齐,否则输出图像的起点会偏移。你用的开发板型号和综合工具版本是什么?不同工具对双端口RAM的原语调用方式不一样,直接套模板可能出时序违例。

  • Verilog新手笔记

    个人感觉你被说延迟大,问题可能不在流水线级数,而在行缓冲的读操作没对齐。很多人把行缓冲的读使能跟写使能混在一起,导致每行末尾的像素还没写完就开始读下一行,结果窗口里的数据是乱的。正确做法是:写使能由tvalid和tready共同控制,读使能在写使能生效后延迟一个像素时钟再开启,这样保证读到的是完整写入的数据。边界复制可以用一个计数器判断当前像素坐标,如果是第一列或最后一列就直接取相邻列的值,不需要额外RAM。如果你能把这三个细节在面试时写成一个简单的时序图,面试官大概就不会让你继续改代码了。

  • 芯片小白

    你的问题核心其实不是流水线级数,而是行缓冲的读写时序是否真的对齐了AXI-Stream的valid/ready握手。很多校招同学写行缓冲时,直接用使能信号去读FIFO,但没考虑上游tvalid可能因为反压而暂停。正确做法是:行缓冲的写使能必须等于tvalid & tready,读使能则在写使能生效后延迟一个周期再开,这样每行末尾的像素写完后再读下一行,窗口数据才不会错位。边界复制可以用一个计数器判断当前像素坐标,第一列直接复用第二列的值,最后一列复用倒数第二列,这样省RAM而且时序干净。你面试官说延迟大,大概率是行缓冲的读操作比写操作抢跑了,导致窗口里的像素不是同一帧的数据。建议你下次面试时,直接画一个写使能、读使能、行地址递增的时序草图,标清楚每个像素从进入行缓冲到出来需要多少周期,面试官一看就明白你理解了关键点。另外,流水线分4级没问题,但第2级窗口提取要小心:3×3窗口需要同时从3个行缓冲里读出数据,读地址必须同步偏移,否则你会读出不同行的错位像素。如果你能把这些细节在黑板上推一遍,面试官大概率不会让你继续改代码了。你现在是用哪个厂商的FPGA?Xilinx和Altera的行缓冲原语不太一样,如果卡在资源上可以换个思路用BRAM配置成真双口。

  • 逻辑设计新人

    1080P60的Sobel边缘检测,行缓冲深度固定3行,流水线分4级:行缓冲写入、窗口提取、梯度计算、阈值判断。你被说延迟大,最可能的原因是行缓冲的读使能没有比写使能延迟一个像素时钟,导致每行末尾的像素还没写完就被读走,窗口数据错位。边界处理用复制最省资源,第一行和最后一行、第一列和最后一列直接复制相邻像素值,不需要额外RAM。代码框架上,建议用双端口BRAM实现行缓冲,写地址递增,读地址比写地址提前一行宽度,这样数据流连续不断。面试官关心的其实不是你能写出多长的代码,而是能不能讲清楚握手信号和流水线平衡。你如果能把tvalid/tready的因果关系画个时序图,比背模板有用得多。你现在的代码里行缓冲是用FIFO还是双口RAM实现的?这个细节会影响反压逻辑。

  • HDL小白

    兄弟,你这个问题我去年校招也踩过坑,面试官说延迟大,十有八九不是流水线级数的问题,而是行缓冲的读写时序没跟AXI-Stream的valid/ready握手对齐。1080P60下像素时钟大概150MHz,行缓冲深度3行没错,但很多人直接用一个FIFO从头读到尾,忽略了上游可能因为反压暂停。正确做法是:写使能必须等于tvalid && tready,读使能则在写使能生效后延迟一个像素时钟再开,这样每行末尾的像素写完了再读下一行,窗口数据才不会串。边界处理用复制最省资源,第一行复用第二行,第一列复用第二列,不需要额外RAM。另外,你流水线分4级是对的,但注意第1级行缓冲写入时,如果下游还没准备好,tready要拉低反压,否则行缓冲会溢出。面试官其实更关心你能不能讲清楚握手信号的因果关系,建议你下次面试时直接画一个写使能、读使能、行地址递增的时序草图,标清楚每个像素从进来到出去需要多少周期,比背模板有用得多。你现在的行缓冲是用FIFO还是双口RAM?这个细节会影响反压逻辑,想清楚再写代码。

  • 二进制菜鸟

    其实手撕Sobel,面试官真正想看的不是你背出一个完整的边缘检测代码,而是你对流水线平衡和握手反压的理解深度。1080P60意味着每行1920像素、每秒60帧,像素时钟约148.5MHz,3行缓冲深度是够的,但你要想清楚:行缓冲的本质是让三行数据同时出现在窗口里,而不是把一整帧都存下来。常见误区是用一个Block RAM做FIFO,把三行数据连续写入,然后用一个读指针从头读到尾,这样当上游tvalid因为反压暂停时,读指针会追尾写指针,导致窗口数据错位。正确做法是用双端口BRAM,写地址递增,读地址比写地址提前一行宽度(1920像素),这样读操作永远落后写操作一行,只要保证读使能在写使能延迟一拍后开启,数据流就是连续的。流水线4级里,最容易被忽略的是第3级梯度计算——你要同时读三个行缓冲的同一列数据,如果三个BRAM的读地址没有同步,窗口提取就会多一个周期延迟。建议统一用一个计数器生成列地址,三个BRAM共用这个地址,同时输出上一行、当前行、下一行的对应像素。边界处理用复制确实省资源,但要注意第一行和最后一行时,行缓冲里只有两行有效数据,你需要用状态机判断当前行号,把缺失的行用相邻行补上,而不是让窗口一直空着。另外,面试官说丢帧,可能不是延迟问题,而是你tready的拉高时机太晚了——如果每帧开始前都要清空行缓冲,那帧与帧之间会有空闲周期,导致有效带宽不够。正确的做法是行缓冲永远不清空,只在帧同步信号(比如tuser)到来时重置列计数器,数据流持续写入和读出,这样就没有帧间隙浪费。你现在的代码里,帧同步信号是接到行缓冲的复位上吗?如果是,那丢帧就是必然的,因为复位会打断正在进行的读写,导致上一帧末尾的数据没读出来就被覆盖了。可以试试把帧同步只用来重置列地址,不要复位BRAM本身,这样数据流就连续了。如果你能把这个因果逻辑在面试时画出来,面试官大概率会点头让你过。

  • 芯片初学者

    其实面试官说你延迟大,大概率不是流水线级数的问题,而是行缓冲的读使能没对齐tready。你用的FIFO做行缓冲吧?那种做法在反压时读指针会追尾写指针。正确做法是:写使能 = tvalid && tready,读使能延迟一拍再开,读地址永远比写地址少一行宽度。边界复制最简单,第一列直接取第二列的值,不用额外RAM。你现在的代码里行缓冲是用双口RAM还是FIFO实现的?这个细节会影响反压逻辑。

  • 码电路的阿明

    个人感觉你被说丢帧,十有八九是握手信号没处理好。1080P60下像素时钟大约150MHz,行缓冲深度3行够了,但很多人忽略了一个细节:当下游反压时,行缓冲的写使能必须跟tvalid和tready同时有效,否则上游会继续发数据撑爆缓冲。我当年校招也栽在这上面,后来改成双端口BRAM,写地址递增,读地址比写地址提前一行宽度,读使能在写使能后延迟一个周期开启,这样数据流就连续了。边界处理推荐复制模式,比补零省逻辑,时序也干净。你面试时别光写代码,画个时序图解释清楚tvalid、tready和行缓冲读写地址的关系,面试官通常会认可。顺便问一句,你用的BRAM是Xilinx原语还是标准双口RAM?

  • 逻辑电路学习者

    你问的是2026年校招的Sobel手撕题,我猜面试官想考察的其实是AXI-Stream握手的流水线平衡能力,而不是边缘检测算法本身。1080P60意味着每帧2073600像素,每秒60帧,像素时钟约148.5MHz,行缓冲深度固定3行——因为Sobel的3×3窗口只需要暂存当前行、上一行和上上行。你的延迟问题大概率出在行缓冲的读写时序上:很多学生会把行缓冲做成一个FIFO,每来一帧就清空重写,但实际AXI-Stream是连续流,你需要用双端口BRAM或移位寄存器实现行缓冲,写地址递增,读地址比写地址提前一行宽度(1920像素),这样读操作永远落后写操作一行。流水线分4级是对的:第1级行缓冲写入,第2级窗口提取,第3级梯度计算,第4级阈值判断。但要注意第1级写入时tready必须反压给上游,否则上游连续发数据会撑爆行缓冲。边界处理我建议用复制模式:用计数器判断当前像素坐标,第一行复用第二行,第一列复用第二列,最后一行复用倒数第二行,最后一列复用倒数第二列,这样不需要额外RAM,且时序比补零更干净。另外,你梯度计算那级如果用绝对值求和代替平方开方,可以省掉DSP,面试官通常不会追究精度。你如果能把这三个细节——行缓冲读写时序、反压逻辑、边界复制——在面试时写成一个简单的时序图,比背模板有用得多。你现在代码里行缓冲是用双口RAM还是寄存器打拍实现的?这个选择会影响时序收敛难度。

  • 嵌入式新手2024

    你问的是Sobel流水线,但面试官说你延迟大、丢帧,我猜问题根本不在你写的4级流水线本身,而在于你默认了上游数据是连续不断的。1080P60的像素时钟大约148.5MHz,每行1920个像素,行缓冲深度3行完全够用,但很多校招同学写行缓冲时,直接把tvalid当写使能,忽略了tready的反压信号。如果下游模块(比如阈值后的输出FIFO)满了,你的行缓冲还在写,数据就会溢出;如果上游暂停了,你的读使能还在跑,读指针就会追尾写指针,窗口里的三行数据就错乱了。正确的做法是:写使能必须等于tvalid & tready,读使能则在写使能生效后延迟一个像素时钟再开启,同时读地址永远比写地址少一行宽度(1920像素),这样无论上游怎么反压,读操作都落后写操作一行,窗口数据永远是连续的。边界处理我建议用复制模式,第一行直接复用第二行的值,第一列直接取第二列的值,这样只需要一个计数器判断当前像素坐标,不需要额外RAM,时序也干净。你流水线分4级是对的,但第1级行缓冲写入时,如果下游反压,tready要拉低,否则上游继续发数据会撑爆行缓冲。面试官其实想看你能否把AXI-Stream的握手信号和行缓冲的读写地址结合起来画一个时序图,而不是背代码。你现在的代码里行缓冲是用双口RAM还是FIFO实现的?这个细节决定了反压逻辑怎么写,建议你改成双端口BRAM,写地址递增,读地址比写地址提前一行宽度,写使能和读使能分别由tvalid/tready和内部状态机控制,这样数据流就是连续的。

登录后可在本页底部提交回答

提问者

EE学生一枚查看主页
浏览「其他」

描述场景与已尝试方案,更容易获得有效解答

相关问题

同分类

提问建议

  • 标题写清核心疑问,避免「求助」「请问」等空泛用语
  • 正文补充环境、版本、报错信息或截图
  • 先搜索本站是否已有相近问题,减少重复提问
  • 若与课程相关,请标明课时或章节便于讲师定位