2026年FPGA校招,海思面试官让我手撕Verilog实现一个AXI4-Stream实时YOLOv8n,脉动阵列的DSP共享策略怎么设计才能不卡时序?我理解DSP资源有限,但多个PE同时运算会导致时序冲突。面试官追问了权重缓冲深度和流水线插入位置,我答得不好。求大佬给个具体推导,包括DSP分时复用、数据对齐和仿真波形验证,最好有代码框架。
2026年FPGA校招,海思面试官让我手撕Verilog实现一个AXI4-Stream实时YOLOv8n,脉动阵列的DSP共享策略怎么设计才能不卡时序?求具体推导和仿真波形
9 个回答

面试官问 DSP 共享策略,其实考察的不是你真去设计一个能跑 YOLOv8n 的脉动阵列——应届生很难在半小时内推导到那一步。他更想看你有没有意识到:权重缓冲深度决定了你能否隐藏数据搬运延迟,流水线插入位置则直接影响乘加树的时序收敛。我建议你从简单的 3×3 脉动阵列开始,先做一次纯组合逻辑的定点乘加,观察时序路径,再在每级乘法器和加法器之间插一级流水线,同时用双缓冲或乒乓 RAM 做权重预取。仿真波形上重点看 valid/ready 握手机制下数据是否对齐,以及每个 PE 的 DSP 使能信号是否错开一个时钟沿。如果觉得 YOLOv8n 的层变化太多,可以先只实现一个卷积层,用参数化模块去适配不同 kernel 大小。你别纠结于完整架构,先跑通一个最小子模块,面试官反而会觉得你有工程落地意识。你现在实际跑过 vivado 的时序报告了吗?还是只在理论推导?
说实话,你被问住的那个权重缓冲深度问题,很多社招老手也未必能在现场给出公式。常见做法是先把输入特征图的行缓存深度设为卷积核宽度减一,再把权重缓存做成双端口 RAM,深度等于该层卷积核数量除以并行度向上取整。至于流水线插入,我习惯在 DSP48E1 的 A/B/C 寄存器全用上之后,再在累加路径上额外加一个寄存器级,这样大部分 200MHz 以下的时钟都能收敛。你没有必要把所有层的时序都打通,面试时能画出数据流图并标出关键路径的寄存器位置,就已经超过 80% 的候选人了。
别想太多,面试官自己也没法在十分钟内写出完整的 YOLOv8n 脉动阵列。你只需要证明你理解流水线级数和 DSP 时分复用的 trade-off 就够了。

你这个问题其实暴露了一个常见的校招误区:以为面试官真的期待你在白板上写出 YOLOv8n 的 AXI4-Stream 实现。实际上,对于2026年的海思 FPGA 岗,面试官更想看到的是你对资源-时序-数据流三者耦合关系的直觉,而不是具体的 Verilog 代码。
先说 DSP 共享策略的核心矛盾:YOLOv8n 的卷积层里,输入通道数通常是 32/64/128,而你的脉动阵列如果每个 PE 独占一个 DSP,那么对于 3×3 卷积,同时需要的 DSP 数量 = 并行输出通道数 x 9,很快就会把 Zynq 或 Kintex 系列吃光。常见的解决思路是让多个 PE 分时复用同一组 DSP,做法是把权重加载和乘加运算在时间上错开:例如,第一拍加载 PE0 的权重并开始运算,第二拍 PE0 进入累加阶段、同时加载 PE1 的权重。这样每个 DSP 在相邻时钟周期处理不同 PE 的数据,但需要保证数据从 BRAM 到 DSP 的路径上插入足够的寄存器,否则因为权重切换导致的组合逻辑延迟会直接让你的时序告警。面试官追问的权重缓冲深度,其实就是这个分时复用模式下,你需要在 BRAM 里预存多少个权重切片才能掩盖 AXI4-Stream 的读延迟。一个经验值是:对于深度可分离卷积的逐点卷积,缓冲深度至少为 4 才能让流水线不冒泡;而对于普通卷积,深度通常需要等于脉动阵列的列数加 2。
你提到面试时答得不好,这很正常,因为这东西在课本上学不到。想补救的话,我建议你回去后做两件事:第一,用 Vivado 搭一个 2×2 的脉动阵列,只做 3×3 卷积中的一个乘法器,跑综合看时序报告,重点观察 DSP48E1 的 CARRYCASCIN 到 PCOUT 路径;第二,写一个简单的 testbench,用 Python 生成随机输入和权重,对比 Verilog 仿真结果和 numpy 卷积结果,确保数据对齐正确。当你真的看到 valid/ready 握手信号因为数据未对齐而拉高的波形时,你对面试问题的理解会比任何推导文章都深。最后问一句:你准备用 AXI4-Stream 的 sideband 信号(比如 tkeep/tstrb)来做数据对齐吗?还是打算直接用固定延迟来对齐?

面试官追问权重缓冲深度和流水线插入位置,说明他真正在意的是你懂不懂数据流和时序的耦合,而不是你能不能写出完整的YOLOv8n。DSP共享策略的核心矛盾是:YOLOv8n的3×3卷积需要9个乘法并行,但一个DSP48E2在一个时钟里只能做一个乘法。常见的做法是让PE分时复用DSP,比如每4个PE共享1个DSP,用MUX切换权重和输入。但这里有个坑:DSP的流水线级数(通常3级)和你插入的额外流水线必须对齐,否则valid/ready握手会错位。我建议你先从单个卷积层开始,用参数化模块控制并行度,仿真时重点观察每个DSP的CE(时钟使能)信号是否错开一个周期,以及输出数据与下一层入口的tready/tvalid是否吻合。别一上来就上YOLOv8n全架构,面试官更想看你会不会拆解问题。另外,权重缓冲深度至少得覆盖DSP的流水延迟+读RAM的延迟,否则数据搬运会卡住。你目前用的开发板型号和工具版本是什么?不同系列的DSP级数不一样,共享策略要微调。

这个问题我猜你是在准备校招时被问懵的,说实话,海思面试官问这个并不是指望你当场写出可综合的代码,而是考察你的工程直觉:你清不清楚DSP资源在YOLOv8n这种大模型下的稀缺性?YOLOv8n的输入通道数通常是32、64、128,假设你设计一个8×8的脉动阵列,每个PE配一个DSP,光一个3×3卷积层就要占用64×9=576个DSP,而主流Kintex-7也就几百个,Zynq更少。所以共享策略是必选项。具体做法:把多个PE的乘加运算映射到同一组DSP上,通过时间分片来错开操作。比如,一个DSP在第一个时钟做PE0的乘法,第二个时钟做PE1的乘法,同时PE0进入累加阶段。这要求权重缓冲深度至少等于共享的PE数量,否则数据来不及切换。流水线插入的位置很关键——要在乘法器输出和加法器输入之间各插一级,否则时序路径太长导致setup违例。仿真验证时,你重点看DSP的PCOUT(级联输出)和PCIN(级联输入)是否对齐,以及每个PE的使能信号是否呈拍频错开。如果你用Vivado,记得在综合后看report_timing_summary,DSP48E2的B端口到P端口的延迟通常是2.5ns左右,留够余量。别犯一个常见错误:把权重预取和运算流水搞成同步,结果造成数据空洞。正确的做法是用双缓冲或乒乓RAM,一个缓冲区加载下一组权重,另一个供当前运算读取。实际工程中,很多人栽在AXI4-Stream的tlast信号处理上,YOLOv8n的每层输出是三维特征图,tlast要标记每行结束和每帧结束,否则数据流会错乱。你目前是只打算用纯Verilog手撕,还是考虑用HLS先搭原型?这会影响你DSP共享的抽象层级。

面试官问这么细,八成是看你简历里写了YOLOv8n项目。DSP共享别想复杂了,你就说:用MUX+计数器控制DSP分时复用,权重缓冲深度设成PE共享数再加两级流水打拍,仿真时盯着CE信号和valid/ready握手看有没有气泡。代码别写太满,先跑通单层3×3再说。追问一句:你YOLOv8n的输入分辨率是多少?不同分辨率下脉动阵列的列数不一样,共享策略要调。

说实话,面试官让你手撕AXI4-Stream的YOLOv8n,重点根本不是让你把整个网络写完——他更想看你面对资源冲突时的取舍逻辑。YOLOv8n的3×3卷积,输入通道数至少32起,如果脉动阵列每个PE都配一个DSP,一个卷积层就能吃掉几百个DSP,而主流FPGA芯片的DSP总量往往在几百到一千出头,所以DSP共享是必然的。但这里有个工程上容易踩的坑:很多人以为分时复用就是加个MUX切换输入,实际上DSP48E2内部自带三级流水线,你额外插入的寄存器级数必须和DSP本身的流水深度对齐,否则valid/ready握手会在跨时钟域或跨层传输时错位。我建议你从最简的3×3单层卷积开始,用参数化模块控制PE数量和DSP共享倍数,比如每4个PE共享1个DSP,然后仿真时重点看三个波形:DSP的CE信号是否在相邻时钟沿错开、权重缓冲RAM的读地址是否提前两个周期预取、以及输出端的tready/tvalid是否出现气泡。权重缓冲深度至少要等于共享的PE数再加两级打拍,否则数据来不及切换。面试官追问流水线插入位置,你就说在乘法器输出和加法器输入之间各插一级,同时把DSP内部的流水线也考虑进来,保证总延迟对齐。别一上来就写完整YOLOv8n,先把这个最小子模块跑通,面试官反而觉得你有工程分解能力。你当前代码跑在哪个器件上?不同芯片的DSP流水级数不一样,策略要微调。

面试官问DSP共享,其实就想听你说一句:用MUX+计数器分时复用,权重缓冲深度设为共享倍数加两拍,流水线插在乘加之间对齐DSP的3级流水。别扯YOLOv8n全架构,先跑通一个3×3卷积层的仿真波形,重点看CE信号有没有错拍。你用的Xilinx还是Intel的片子?

这类问题我当年校招也遇到过,面试官其实不是要你当场写出可综合的YOLOv8n,而是考你两个直觉:一是DSP资源瓶颈下如何做时间分片,二是数据流和时序的耦合怎么处理。YOLOv8n的3×3卷积,输入通道数32/64/128,如果脉动阵列是8×8,每个PE配一个DSP,光一个3×3层就要64×9=576个DSP,而主流Kintex-7也就几百个,所以共享是必选项。我当时的做法是让4个PE共享1个DSP,用双缓冲RAM做权重预取,仿真波形上先看valid/ready握手有没有气泡,再看DSP的CE信号是否错开一个时钟沿。权重缓冲深度至少覆盖共享PE数再加两级,否则数据来不及切换。你如果手头有Vivado或Quartus,可以先搭一个参数化的3×3卷积模块,跑通时序再扩展到全网络。你现在用的是哪个型号的FPGA?不同芯片的DSP流水级数不同,共享策略要跟着调。

面试官问DSP共享策略,其实你卡住的地方不是技术细节,而是没想清楚他真正要考察什么——他要看你有没有能力在资源受限时做工程取舍。YOLOv8n的3×3卷积输入通道32起,如果你设计的是8×8脉动阵列,每个PE一个DSP,那一个卷积层就需要至少576个DSP,而主流FPGA的DSP总量往往只有几百到一千出头。所以共享是绕不开的。但别一上来就想着怎么把整个YOLOv8n塞进去,面试官更想听你拆解问题:你先说出核心矛盾——DSP的分时复用会导致数据通路带宽翻倍,进而影响时序。常见的做法是让4个PE共享1个DSP,用MUX加计数器控制,权重缓冲深度设为共享数再加两级流水打拍,这样能掩盖DSP内部三级流水线的延迟。但有个容易忽略的点:DSP48E2的CE信号必须和你的分时计数器对齐,否则跨时钟域或跨层传输时valid/ready会错位。仿真时别只看功能对不对,重点盯三个波形——CE是否错开一拍、权重缓冲的读地址和DSP使能是否同步、输出数据与下一层tready的握手有没有气泡。如果你手头有Vivado,可以先搭一个参数化的3×3卷积子模块,只测一个卷积层,跑通时序再考虑扩展。别纠结完整架构,面试官反而会觉得你有工程落地意识。你现在用的是哪个系列的片子?不同芯片的DSP数量和流水级数不一样,共享策略要微调。
发表回答
登录后可在本页底部提交回答