海思面试官让我手撕Verilog实现AXI4-Stream实时图像拼接,输入是四路1080p30视频流,要求输出2×2拼接画面。我卡在帧对齐这里,多路输入到达时间不同步,用FIFO缓存的话BRAM爆了。面试官说用行缓冲加流水线帧同步,但我没理解具体怎么实现。求大佬给出具体代码框架,怎么用状态机控制帧起始信号对齐,以及行缓存深度怎么根据最大延迟推导?
2026年FPGA秋招,海思面试官让我手撕Verilog实现AXI4-Stream实时图像拼接,多路输入帧对齐怎么设计才能不漏帧?求具体代码框架
12 个回答

帧对齐的核心不是等所有路同时到,而是用帧起始信号打拍子。你只要在每路FIFO写使能时记录当前帧的起始位置,状态机检测到四路都来了帧头,再统一释放读使能。BRAM爆了说明你缓存了整帧,改行缓存深度=最大行延迟+1行就够了,别存整帧。

面试官说的行缓冲加流水线帧同步,本质是把帧对齐问题拆成两步:第一步用FIFO吸收各路到达时间差,但FIFO深度不按整帧算,按最大行延迟+1行算。举个例子,如果四路中最晚的那路比最早的那路晚到了10行,那FIFO深度设成11行(192024bit11大概500Kb)就够了,远小于一帧的3Mb左右。第二步是关键:每路进来时,用状态机检测帧起始信号(比如tuser),一旦检测到就启动一个计数器,记下当前行号。状态机只在四路都检测到帧起始且行号对齐时才同时开启写使能。常见误区是直接用满信号控制读取,那样会导致每路各自为政,拼接时行错位。另外,AXI4-Stream的tlast也得配合好,每行结束时清空行缓冲状态。你手撕代码时,状态机至少要有IDLE、WAIT_SYNC、ALIGNED、RUN四个状态,WAIT_SYNC里轮询各路tuser,ALIGNED里比较行号差是否在容忍范围内。你目前用的工具链是Vivado还是Quartus?行缓存是用分布式RAM还是BRAM?

换个思路:别想着四路同时对齐,用双帧缓冲机制。每路进来先写进两个行FIFO(乒乓操作),一个存当前行,一个存下一行。帧起始信号来了之后,状态机只负责在每行结束时检查四路是否都写完了当前行,如果某路慢了就插入空白行(比如全0像素),等它赶上来再切回正常数据。这样BRAM用量是固定的:深度=一行像素数2,跟延迟无关。缺点是有可能丢一行数据,但面试场景下你提这个方案说明你理解流水线吞吐和资源折中,比死磕精确对齐更显工程思维。追问一句:面试官有没有限定输出必须连续无气泡?如果有,那还是得用我前面说的行延迟+1方案。

帧起始信号对齐其实比你想的简单。你不需要等四路同时到同一时刻才动作,而是每路自己检测到帧头后就启动行号计数器,同时把数据写进自己那路的行FIFO。状态机只做一件事:等四路都检测到帧头并且当前行号一致,才统一拉高所有路的读使能。FIFO深度设成最大行延迟+1行,比如最晚那路比最早晚到5行,深度就设6行1080像素,算下来大概几百Kb,BRAM完全扛得住。常见坑是有人去同步tuser的边沿,结果在状态机里反复跳转,其实你只需要在IDLE等待四路tuser都到一次,然后切到RUN态,之后每行结束用tlast检查行号是否对齐,不对齐就插入空白像素。你手撕代码时重点把状态转移图画清楚,面试官更看重你懂这个原理,不是非要一字不差写完。追问:你算过海思平台下行缓存深度具体能到多少吗?

我直接给你讲个我当年踩过的坑吧。当时我也在纠结帧对齐,第一版用双帧缓存,结果资源直接爆了,面试官当场让我改方案。后来我按他提示的思路走:关键是别把帧当作整体对齐,而是按行来对齐。具体框架分三块:一是每路前放一个异步FIFO,深度固定为最大行延迟+2行,用安全裕度;二是全局状态机,我设了IDLE、WAIT_FRAME、ALIGNED、RUN、RESYNC五个状态。IDLE下各路独立等待tuser,一旦某路来了tuser就记下它的行号计数器初值;等到四路都离开IDLE,状态机进入WAIT_FRAME,此时比较各路的行号,如果行号差超过1行,说明某路丢帧或者错位严重,这时就强制让快的路插入空白行,直到行号重新对齐;对齐后切到RUN态,每行结束时用tlast触发一次行号增量检查,如果某路tlast没来就给它补空白。三是写使能控制:在RUN态下,各路的读使能由状态机统一拉,但写使能始终由上游tvalid控制,这样不会漏掉任何数据。你问代码框架怎么搭,我建议按模块拆分:sync_ctrl.v负责状态机,line_buf.v例化四个FIFO,merge_ctrl.v负责拼接输出时序。说到面试官考察点,其实他更在意你能否说出资源计算的推导过程——比如为什么深度是行延迟+1而不是+2,因为行延迟本身是整数行,加1行是为了处理亚稳态和时钟域同步的拍数。你如果能现场画出状态转移图,再估算出BRAM用量(比如1080p30每行1920像素,24bit色深,一行大概46Kb,深度6行约276Kb,四个路总共1.1Mb,一般在片内BRAM范围内),那基本就稳了。追问:面试官有没有让你考虑tready反压?如果输出端反压了,你的行FIFO深度还要额外加反压等待的行数。

换个实用点的角度:你其实不需要真的等四路帧头都到齐才启动。实际工程里常见做法是设一个超时计数器,比如等10000个时钟周期内四路tuser还没到齐,就强制认为某路丢帧,然后用上一帧的数据补上或者直接输出黑屏。这个在面试时提出来,能体现你对异常处理的思考。行FIFO深度按最大行延迟+1行设计没错,但要注意这个最大行延迟是指各路帧起始时间差换算成的行数,不是物理延迟。比如最晚那路比最早晚了3.7行,那深度就设5行(向上取整加1)。状态机方面,我习惯在ALIGNED态里额外加一个校验:每行结束后检查四路tlast是否都在预期周期内到来,如果某路tlast早到或迟到超过一个行周期,就回退到WAIT_FRAME重新对齐。这样能防止累积误差导致后续行错位。还有一个容易被忽略的点:AXI4-Stream的tkeep信号,拼接时每路的行像素宽度可能不同(比如边界像素需要补全),你需要在状态机里同时控制tkeep的生成逻辑。说句实在的,海思这种大厂面试,手撕代码只是手段,他们更想看你遇到资源瓶颈时能不能想到行缓存这个折中方案。你目前是在准备笔试阶段还是已经进面了?这个信息会影响我推荐你重点练状态机还是练时序分析。

你面试时能想到用帧起始信号对齐而不是直接等四路同时到,说明思路已经对了。实际工程里,我建议你把状态机分成两个层次:第一层是每路独立的帧头检测,一旦tuser有效就把数据写进该路的行FIFO,同时启动一个行计数器;第二层是全局状态机,它只做一件事——等四路的行计数器都达到同一个值,才同时拉高所有FIFO的读使能。这个设计的好处是,你不需要在状态机里反复判断谁先谁后,FIFO深度按最大行延迟+1行算就够了,比如最晚那路比最早晚了3行,深度就设4行,大概1080x24x4约100Kb,四路加起来也就400Kb,远小于一帧的3Mb。面试官之所以提行缓冲加流水线,是因为他知道BRAM资源紧张,整帧缓存是新手常见的坑。另外,你手撕代码时别忘了处理tlast:每行结束时,如果某路的tlast没来,状态机应该主动插入一行空白像素并让该路FIFO跳过,否则累积错位会越来越严重。追问一句:你面试时,面试官有没有让你具体估算一下BRAM块数?这往往是考察资源意识的隐藏考点。

你问的是海思面试,我推测他们更看重你对实时视频流中背压和气泡的理解,而不仅仅是帧对齐本身。AXI4-Stream的ready/valid握手在拼接场景下有个容易被忽视的细节:如果某路FIFO读使能没跟上,导致该路输出出现气泡,下游拼接模块必须能容忍这些气泡,否则整个输出会花屏。我的做法是在全局状态机里加一个输出仲裁器,它根据四路FIFO的空状态动态调整读优先级——哪路数据先就绪就读哪路,但保证每行内四路的像素序号严格同步。具体到行缓存深度推导,你提到的最大行延迟+1行其实只是一个起点。实际工程里,因为时钟域可能不同(比如四路来自不同摄像头,PLL不同),你还要考虑异步FIFO的格雷码同步延迟,一般再加2到3个时钟周期的裕度。所以深度公式可以写成:max_line_delay_in_clocks / pixels_per_line + 2。举个例子,如果最大行延迟是10个1080p行周期,像素时钟148.5MHz,那深度就是10+2=12行,每行1920x24bit约55Kb,四路共220Kb,一个18Kb的BRAM大概用12个,完全在合理范围内。你准备这个题时,建议手撕代码时把状态机画成三段式:第一段是组合逻辑写状态转移,第二段是时序逻辑更新状态,第三段是组合逻辑输出读使能和tuser/tlast生成。面试官如果追问为什么不用双帧缓冲,你就说双帧缓冲虽然能简化控制逻辑,但BRAM用量翻倍,对于2×2拼接这种场景,行缓冲方案在资源和延迟上更优。最后提醒一句:你可以在状态机的ALIGNED态里加一个看门狗计数器,如果连续超过一帧时间没检测到某路tuser,就强制复位该路FIFO并输出黑屏,避免死锁。这样能体现出你对异常流的处理能力。追问:你目前手头有仿真环境吗?我建议你用Vivado的AXI VIP快速搭个testbench,重点验证行号错位时的恢复逻辑,这个比干写代码更有收获。

海思面试官让你手撕,说明他看重代码细节和资源意识。你提到的帧对齐,核心是用帧起始信号(tuser)做同步,而不是等四路数据同时到齐。具体来说,每路进来时,检测到tuser有效就启动一个行计数器,同时把数据写进该路的行FIFO。状态机建议设IDLE、WAIT_SYNC、ALIGNED、RUN四个态。IDLE下各路独立等tuser,一旦某路来了就记下它的起始行号,进入WAIT_SYNC。等四路都检测到tuser且行号对齐(比如行号差不超过1),才切到ALIGNED,统一拉高所有FIFO的读使能,进入RUN态。之后每行结束时用tlast触发一次行号校验,如果某路tlast早到或迟到超过一个行周期,就回退到WAIT_SYNC重新对齐,防止累积错位。行FIFO深度按最大行延迟+1行算,比如最晚那路比最早晚了3行,深度就设4行。这里有个常见风险:如果异步FIFO的格雷码同步延迟忽略,深度可能不够,建议再加2个时钟周期裕度。另外,面试官提到行缓冲,是因为BRAM按整帧缓存要3Mb左右,而四路行FIFO加起来才几百Kb,资源省很多。追问一下:你算过海思平台下行缓存深度具体能到多少吗?这个数字面试时随口报出来会加分。

你卡在帧对齐,其实是因为把问题想复杂了。海思面试官提行缓冲加流水线,本质上是让你把帧对齐拆成两步:第一步用FIFO吸收时间差,第二步用状态机保证行号同步。具体框架分三块:一是每路前放一个异步FIFO,深度按最大行延迟+1行,再加2个时钟周期裕度(因为格雷码同步有延迟)。二是全局状态机,我习惯设IDLE、WAIT_SYNC、ALIGNED、RUN、RESYNC五个态。IDLE下各路独立等tuser,一旦某路来了,记下它的行号计数器初值。等四路都离开IDLE后进入WAIT_SYNC,此时比较各路的行号,如果差超过1行,说明某路丢帧或错位严重,就强制让快的路插入空白行(比如全0像素),直到行号重新对齐。对齐后切到ALIGNED,再统一拉高所有FIFO的读使能,进入RUN态。RUN态下,每行结束时用tlast触发一次行号增量检查,如果某路tlast没来就补空白。三是异常处理:设一个超时计数器,比如等10000个时钟周期内四路tuser还没到齐,就强制认为某路丢帧,用上一帧的数据补上或直接输出黑屏。这样能体现你对异常场景的思考。资源方面,四路行FIFO深度假设5行,每行1920x24bit,大概230Kb,加上状态机逻辑,BRAM和LUT都绰绰有余。你手撕代码时,重点画状态转移图,面试官更看重你懂这个原理,不是非要一字不差写完。另外,AXI4-Stream的tkeep信号别忘了处理,拼接时每路像素宽度可能不同,tkeep要按输出格式重新生成。个人感觉,你面试时能主动提超时和资源计算,比单纯背代码框架更显工程思维。追问一句:面试官有没有限定输出必须连续无气泡?如果有,那状态机里还得加一个输出仲裁器,根据四路FIFO的空状态动态调整读优先级,保证tvalid连续拉高。
发表回答
登录后可在本页底部提交回答